{"text_format":"1","workbook":"xlsx","n_sheets":5,"sheets":["Workbook Instructions","Part 1- Qual Support References","Part 2 - Technical Data","Lookup","Part 3 - Qual Eval Scoresheet"],"not_rendered":{"charts":0,"images":2,"macros":1,"external_links":0,"defined_names":51,"comments":0,"pivot_tables":0},"unopened":[],"bounds":{"document_bytes":16777216,"sheet_cells":100000,"rows_first":2000,"rows_last":500,"rows_between":2000,"halvings":0,"cell_chars":16384,"cell_head_chars":4096},"cells_cut":0,"cells_raw":0,"read":"whole","date_system":"1900"}

{"sheet":"Workbook Instructions","index":0,"n_rows":79,"n_cols":4,"rows_kept":79,"cut":false,"hidden":false,"merged":[[0,0,0,3],[2,0,2,3],[12,0,12,3],[1,0,1,3],[5,0,5,3],[4,0,4,3],[7,0,7,3],[8,0,8,3]]}
["Invitation for Bid: GPA-012-23"]
["Renewable Energy Resource Acquisition for the Guam Power Authority (Phase IV)"]
["QUALITATIVE SCORING WORKBOOK INSTRUCTIONS"]
[]
["Bidders should enter their name in highlighted cell, this will title the other sheets in the workbook with the Bidder's name."]
[]
[]
["Bidder should enter a unique bid no. (1,2,3….) in the highlighted cell if submitting more than one bid."]
["<<< BIDDER'S BID NO >>>"]
[]
[]
["Overview:"]
["Bidders are required to complete Task 1 and Task 2 described below.  GPA staff will complete Tasks 3 and 4.  Bidders must fill in the worksheets titled \"Part 1- Qual Support References\" and \"Part 2 - Technical Data\" and return an electronic copy of this entire workbook with their IFB submittals. GPA will review each Bidder's submittal  of Task 1 to ensure that the referenced pages/sections given by the Bidder in the worksheet truly support compliance with the Technical Requirements. The Bidders have been given the Task 1 worksheet to facilitate the bid evaluation. In addition, GPA has requested for specific technical information that must be provided as described in Task 2.  For the Bidders' reference, there is a copy of the scoring sheet used to qualify/disqualify the Unpriced Technical Offers on the worksheet titled \"Part 3 - Qual Eval Scoresheet.\" The Bidders may use this sheet as a tool to assess the strength of their submittals. However, GPA evaluators will fill this information in for each bid received and only the GPA evaluators' scorings will count."]
[]
["Task 1:",null,null,"Complete the worksheet titled \"Part 1-Qual Support References"]
[null,null,null,"Each Bidder Must Complete Task 1."]
[]
["Step",null,null,"Directions"]
[1,null,null,"Go to the \"Part 1 - Qual Support References\" worksheet."]
[]
[2,null,null,"In Column E, labeled \"Bid Reference,\" cite the volume, chapter, section, page number, etc. of the Bidder's submittal where the information supporting compliance for the given Checklist Item can be found. Give locational references as specifically as possible. Leave the reference cell blank if the bid does not contain adequate supporting information for the given Checklist Item."]
[]
[]
["Task 2:",null,null,"Complete the worksheet titled \"Part 2 - Technical Data\""]
[null,null,null,"Each Bidder Must Complete Task 2."]
[]
["Step",null,null,"Directions"]
[1,null,null,"Go to the \"Part 2 - Technical Data\" worksheet."]
[null,null,null,"This width of this sheet (columns B to Q) can be viewed completely by setting zoom to 84%"]
[]
[2,null,null,"Fill in the yellow highlighted cells in this worksheet with the information requested.  Additional instructions are provided below.  If any of the items are not applicable, mark \"N/A\"."]
[]
[null,"No:",null,"Technical Data Request:"]
[null,"1.",null,"Provide the name of the company bidding."]
[null,"2.",null,"Provide Bidder contact information."]
[null,"3.",null,"Provide the name of the renewable energy project."]
[null,"4.",null,"Assign a bid number to the bid form. If a Bidder is submitting two alternative bids for the same project, the bid number would be 1 for the first and 2 for the second.  Alternative bids might be submitted for different CODs, project sizes, etc."]
[null,"5.",null,"Select the renewable energy technology being utilized by the project.  If the technology is not listed in the selection list enter the technology on the space provided directly to the right of the selection box."]
[null,"6.",null,"Provide the location of the project by street address (if available).  If a street address is not applicable, provide GPS coordinates or a general description of where the project is located."]
[null,"7.",null,"Indicate whether the proposed facility is new or existing.  This refers to the project that will be supplying renewable energy in this bid request."]
[null,"8.",null,"Provide the names, contact information, and ownership share for project owner(s)."]
[null,"9.",null,"Provide the requested project technical information specific to the project being proposed."]
[null,"9.A",null,"Date of Initial Operation.  Provide the date at which the project is operational.  This may not be the date at which GPA will begin to receive renewable power (i.e. startup for test)"]
[null,"9.B",null,"Agreement beginning date.  Provide the date at which GPA will begin receiving renewable energy.  Note:  May not be the same as 9.A."]
[null,"9.C",null,"Nameplate capacity of the facility in kW."]
[null,"9.D",null,"ESS capacity, in MW and MWh."]
[null,"9.E",null,"Estimated annual capacity factor (net) percentage."]
[null,"9.F",null,"Guaranteed net annual generation in MWh/yr.  Bidders are required to provide annual production guarantees for each contract year."]
[null,"9.G",null,"Minimum annual generation in MWh/yr at 95% Confidence Level.  Bidders are required to provide annual production for each contract year."]
[null,"9.H",null,"Guaranteed Success Rate, AC-AC Efficiency and Availability in percentage."]
[null,"9.I",null,"Estimated equivalent availability factor percentage."]
[null,"9.J",null,"Expected project life in years."]
[null,"10.",null,"Provide the requested project interconnection and transmission information:"]
[null,"10.A",null,"Voltage at which the project interconnects to the transmission system."]
[null,"10.B",null,"Point of interconnection or interconnection substation name."]
[null,"10.C",null,"Name of the transmission line on which the project is interconnected."]
[null,"10.D",null,"Total interconnection cost.  Bidder is to provide estimate on interconnection costs.  GPA will conduct a system interconnection study for bidders who have been selected for award at the cost of the selected bidder to verify and confirm the amount provided here."]
[null,"11.",null,"Provide the requested Power Purchase Agreement Non-Pricing Information:"]
[null,"11.A",null,"Term of the agreement, in years.  "]
[null,"11.B",null,"Contract net capacity, in MW.  Contracts with selected bidders will be based on the capacity provided here.  GPA will not be obligated to purchase additional energy beyond the proposed project capacity."]
[null,"12.",null,"Provide the monthly estimated average net MWh per hour for every hour of the day.  GPA requests for operation profile to evaluate the project.  Annual projections must equal the Guaranteed net annual generation in 9.G above."]
[null,"13.",null,"Provide the monthly estimated net portfolio credits per hour for every hour of the day."]
[null,"14.",null,"If the Bidder is proposing an arrangement not covered by either of the preceding categories, the Bidder may include a description of the agreement here.  The Bidder is responsible for providing sufficient information to allow GPA to evaluate this alternative bid package."]
[]
[]
["Task 3:",null,null,"Review the Bidder's information referenced under Task 1 and Task 2."]
[null,null,null,"GPA Evaluators Shall Complete Task 3."]
[]
["Step",null,null,"Directions"]
[1,null,null,"Review Bidder entries in Column E of the sheet \"Part 1 - Qual Support References\" and additional information in \"Part 2 - Technical Data.\"  Using these entries, evaluate the Bidder's supporting documents to determine if the Bidder has provided enough information and has met the Technical Requirements."]
[]
[]
["Task 3:",null,null,"Score the Bidder's IFB submittal using the worksheet titled \"Part 2 - Qual Eval Scoresheet\""]
[null,null,null,"GPA Evaluators Shall Complete Task 3."]
[]
["Step",null,null,"Directions"]
[1,null,null,"Go to the \"Part 2 - Qual Eval Scoresheet\" worksheet."]
[]
[2,null,null,"In Column H, rate the quality of the Bidder's response to each requested Checklist Item, based on review of the submittal. "]

{"sheet":"Part 1- Qual Support References","index":1,"n_rows":140,"n_cols":8,"rows_kept":140,"cut":false,"hidden":false,"merged":[[135,7,136,7],[24,5,25,5],[107,7,108,7],[109,7,110,7],[117,7,120,7],[124,7,126,7],[96,7,97,7],[98,7,99,7],[100,7,101,7],[103,7,104,7],[82,7,83,7],[87,7,88,7],[92,7,93,7],[42,7,44,7],[47,7,48,7],[55,7,56,7],[65,7,68,7],[76,7,77,7],[117,5,120,5],[124,5,126,5],[107,5,108,5],[103,5,104,5],[47,5,48,5],[100,5,101,5],[33,7,34,7],[37,7,39,7],[36,2,36,3],[39,2,39,3],[37,1,37,3],[32,2,32,3],[5,7,6,7],[7,7,11,7],[12,7,13,7],[18,7,19,7],[24,7,25,7],[37,5,39,5],[33,5,34,5],[31,2,31,3],[17,2,17,3],[24,2,24,3],[33,2,33,3],[35,2,35,3],[37,4,39,4],[33,4,34,4],[114,1,114,3],[113,1,113,3],[112,1,112,3],[111,1,111,3],[106,2,106,3],[102,1,102,3],[101,1,101,3],[28,2,28,3],[29,2,29,3],[30,2,30,3],[46,2,46,3],[40,2,40,3],[64,1,64,3],[75,2,75,3],[74,2,74,3],[66,1,66,3],[135,2,135,3],[121,2,121,3],[122,2,122,3],[123,2,123,3],[125,2,125,3],[115,1,115,3],[118,1,118,3],[120,2,120,3],[124,1,124,3],[116,1,116,3],[98,4,99,4],[87,4,88,4],[45,2,45,3],[55,4,56,4],[38,1,38,3],[110,1,110,3],[99,2,99,3],[107,1,107,3],[103,1,103,3],[103,4,104,4],[108,2,108,3],[80,1,80,3],[96,4,97,4],[65,1,65,3],[98,1,98,3],[79,2,79,3],[76,2,76,3],[92,1,92,3],[82,1,82,3],[97,2,97,3],[93,2,93,3],[94,2,94,3],[95,2,95,3],[104,2,104,3],[139,0,139,3],[5,5,6,5],[7,4,11,4],[7,5,11,5],[109,5,110,5],[65,4,68,4],[76,4,77,4],[87,5,88,5],[92,5,93,5],[98,5,99,5],[96,5,97,5],[82,4,83,4],[92,4,93,4],[82,5,83,5],[124,4,126,4],[135,4,136,4],[109,4,110,4],[76,5,77,5],[47,4,48,4],[117,4,120,4],[100,4,101,4],[135,5,136,5],[105,2,105,3],[107,4,108,4],[0,0,0,5],[1,0,1,5],[2,0,2,5],[12,5,13,5],[18,5,19,5],[65,5,68,5],[44,2,44,3],[41,2,41,3],[43,1,43,3],[8,1,8,3],[24,4,25,4],[18,4,19,4],[12,4,13,4],[3,0,3,3],[55,2,55,3],[42,4,44,4],[42,1,42,3],[9,1,9,3],[18,2,18,3],[67,2,67,3],[42,5,44,5],[47,2,47,3],[55,5,56,5],[5,0,6,3]]}
["Invitation for Bid: GPA-012-23"]
["Renewable Energy Resource Acquisition for the Guam Power Authority (Phase IV)"]
["PART 1 - QUAL SUPPORT REFERENCES"]
[{"$f":"CONCATENATE(\"Bidder's Name:  \",'Workbook Instructions'!A6)","v":"Bidder's Name:  "},null,null,null,{"$f":"CONCATENATE(\"Bidder's No.:  \",'Workbook Instructions'!A9)","v":"Bidder's No.:  <<< BIDDER'S BID NO >>>"},{"$f":"+IF(H140>0,\"DATA MISSING\",\"No Error\")","v":"DATA MISSING"},null,"TEST ERROR"]
[]
["EVALUATION FACTORS",null,null,null,"BID REFERENCE","ALERTS"]
[null,null,null,null,"(Enter the chapter/section and page number where information is to be found within submitted materials)"]
["A.  PROJECT DEVELOPMENT",null,null,null,null,{"$f":"IF(ISBLANK(E8),\"<<< Reference Required\",\"\")","v":"<<< Reference Required"},null,{"$f":"IF(F8=\"<<< Reference Required\",1,0)","v":1}]
[null,"A1.  Method and status of project financing (3)"]
[null,"Bidders are required to provide responses to all questions below. Bidders are required to demonstrate the financial viability of their project. Bidders should provide the following information:"]
[null,null,"A1-a.  Identification of equity participants."]
[null,null,null,"• Who are the equity participants in the project?"]
[null,null,"A1-b.  Evidence that the project will be financed.",null,null,{"$f":"IF(ISBLANK(E13),\"<<< Reference Required\",\"\")","v":"<<< Reference Required"},null,{"$f":"IF(F13=\"<<< Reference Required\",1,0)","v":1}]
[null,null,null,"• How will the project be financed?"]
[null,null,null,"• Is there a written commitment from the equity participants? If so, please provide a copy with confidential information redacted if necessary.",null,{"$f":"IF(ISBLANK(E15),\"<<< Reference Required\",\"\")","v":"<<< Reference Required"},null,1]
[null,null,null,"• Discuss and/or provide supporting information on any project financing guarantees.",null,{"$f":"IF(ISBLANK(E16),\"<<< Reference Required\",\"\")","v":"<<< Reference Required"},null,1]
[null,null,null,"• Does the developer envision any conditions precedent to project financing other than execution of the power purchase agreement and Guam Public Utilities Commission approval of the power purchase agreement? If so, what do you expect them to be?",null,{"$f":"IF(ISBLANK(E17),\"<<< Reference Required\",\"\")","v":"<<< Reference Required"},null,1]
[null,null,"A1-c.  Description of the Bidder’s organizational structure from a financial and legal perspective, including any general and limited partners, involvement of subsidiaries, providers of capital, and percentage interest of each party.",null,null,{"$f":"IF(ISBLANK(E18),\"<<< Reference Required\",\"\")","v":"<<< Reference Required"},null,1]
[null,null,"A1-d.  Provide a description of the financing plan for the project, including construction and term financing. The financing plan should address information contained in the pro forma, such as:",null,null,{"$f":"IF(ISBLANK(E19),\"<<< Reference Required\",\"\")","v":"<<< Reference Required"},null,1]
[null,null,null,"• The project’s projected financial structure"]
[null,null,null,"• Expected sources of debt and equity financing",null,{"$f":"IF(ISBLANK(E21),\"<<< Reference Required\",\"\")","v":"<<< Reference Required"},null,1]
[null,null,null,"• Estimated capital cost.",null,{"$f":"IF(ISBLANK(E22),\"<<< Reference Required\",\"\")","v":"<<< Reference Required"},null,1]
[null,null,null,"• Evidence the project is financeable",null,{"$f":"IF(ISBLANK(E23),\"<<< Reference Required\",\"\")","v":"<<< Reference Required"},null,1]
[null,null,null,"• In addition, the financing plan should address the financing of development costs. All bidders are required to provide this information.",null,{"$f":"IF(ISBLANK(E24),\"<<< Reference Required\",\"\")","v":"<<< Reference Required"},null,1]
[null,null,"A1-e.  Provide documentation illustrating the experience of the project sponsor in securing financing for projects of similar size and technology. For each project provide the following information:",null,null,{"$f":"IF(ISBLANK(E25),\"<<< Reference Required\",\"\")","v":"<<< Reference Required"},null,1]
[null,null,null,"• Project name and location"]
[null,null,null,"• Project type and size",null,{"$f":"IF(ISBLANK(E27),\"<<< Reference Required\",\"\")","v":"<<< Reference Required"},null,1]
[null,null,null,"• Date of construction and permanent financing",null,"<<< Reference Required",null,1]
[null,null,"A1-f.  Provide evidence that the Bidder has the financial resources and financial strength to complete and operate the project as planned.",null,null,"<<< Reference Required",null,1]
[null,null,"A1-g.  Provide copies of the most recent audited financial statement or annual report for each Bidder, including affiliates of the Bidder. Also, list the current credit rating from Standard & Poor’s and Moody’s for the sponsor, affiliates, partners, and credit support provider.",null,null,"<<< Reference Required",null,1]
[null,null,"A1-h.  The Bidder should demonstrate its ability (and/or the ability of its credit support provider) to provide the required security, including its plan for doing so (including type of security, sources of security and a description of its credit support provider).",null,null,"<<< Reference Required",null,1]
[null,null,"A1-i.  Provide a description of any current credit issues regarding the Bidder or affiliate entities raised by rating agencies, banks, or accounting firms.",null,null,"<<< Reference Required",null,1]
[null,null,"A1-j.  Describe the implication of the federal Production Tax Credits or Investment Tax Credits (or similar incentives) on the viability of the project.",null,null,"<<< Reference Required",null,1]
[null,null,"A1-k.  Provide a memorandum with supporting information demonstrating that the proposal will not be subject to Variable Interest Entity treatment[1] and that GPA will not have to carry this entity on its financial statements.",null,null,"<<< Reference Required",null,1]
[null,null,null,"NOTE [1] GPA is not willing to be subject to accounting treatment that results from variable interest entity (“VIE”) treatment as set forth in Financial Accounting Standards Board Interpretation No. 46 (revised December 2003) (“FIN46R”)."]
[null,null,"A1-l.  Pro forma income and cash flow statement conforming to Generally Accepted Accounting Principles for the project for the term of the proposed Power Purchase Agreement (include revenue and cost data by major categories, debt service, depreciation expenses and other relevant information). Bidders may propose to submit their financial pro forma to a mutually agreed upon independent third party rather than to GPA. Bidders should note that this information will be required of short-listed bidders only and will be requested by GPA upon shortlist notification or after. Should GPA request pro forma financial information from the bidder, the information will only be used for project viability assessment only.",null,null,{"$f":"IF(ISBLANK(E36),\"<<< Reference Required\",\"\")","v":"<<< Reference Required"},null,1]
[null,null,"A1-m.  Bidders must disclose any litigation related to projects owned or managed by them or any of their affiliates in the United States.",null,null,{"$f":"IF(ISBLANK(E37),\"<<< Reference Required\",\"\")","v":"<<< Reference Required"},null,1]
[null,"A2.  Level of site control by developer (3)",null,null,null,{"$f":"IF(ISBLANK(E38),\"<<< Reference Required\",\"\")","v":"<<< Reference Required"},null,1]
[null," Bidders should provide GPA with some confidence regarding the level of control Bidder has on the project site. "]
[null,null,"A2-a.  Provide a map of the site that clearly identifies the location of the site, the total acreage, the interconnection point, and the relationship of the site to other local infrastructure. In addition to providing the required map, provide a site layout plan which illustrates the location of all equipment and facilities on the site."]
[null,null,"A2-b. Identify any rights-of-way or easements that are required for access to the project or for interconnection. Describe the status of rights-of-way and easement acquisition, and describe the plan for securing the necessary rights-of-way, including the proposed timeline.",null,null,{"$f":"IF(ISBLANK(E41),\"<<< Reference Required\",\"\")","v":"<<< Reference Required"},null,1]
[null,null,"A2-c. Describe whether the project has the capability for expansion at the proposed site. If so, describe the expansion capability possible.",null,null,"<<< Reference Required",null,1]
[null,"A3.  Project team experience (5)",null,null,null,{"$f":"IF(ISBLANK(E43),\"<<< Reference Required\",\"\")","v":"<<< Reference Required"},null,1]
[null,"Bidders are required to demonstrate project experience and management capability to successfully develop and operate the project proposed. GPA is interested in a project team which has demonstrated success in projects of similar type, size and technology and can demonstrate an ability to effectively work together to bring the project to commercial operation in a timely fashion."]
[null,null,"A3-a. Provide an organizational chart for the project that lists the project participants and identifies the management structure and responsibilities."]
[null,null,"A3-b. For each of the project participants (including the Bidder, partners, and proposed contractors), provide statements that list the specific experience of the firm in developing, financing, owning, and operating generating facilities, other projects of similar type, size and technology, and any evidence that the project participants have worked jointly on other projects. If a bidder is relying on the experience of a consultant or contractor to meet the Experience Threshold Requirement, the bidder should describe any contractual relationships between the bidder and the consultant or contractor.",null,null,{"$f":"IF(ISBLANK(E46),\"<<< Reference Required\",\"\")","v":"<<< Reference Required"},null,1]
[null,null,"A3-c. Provide a management chart which lists the key personnel dedicated to this project and provide profiles or curriculum vitae of the key personnel.",null,null,{"$f":"IF(ISBLANK(E47),\"<<< Reference Required\",\"\")","v":"<<< Reference Required"},null,1]
[null,null,"A3-d. Provide a listing of all projects the project sponsor has successfully developed or that are currently under construction. Provide the following information as part of the response:",null,null,{"$f":"IF(ISBLANK(E48),\"<<< Reference Required\",\"\")","v":"<<< Reference Required"},null,1]
[null,null,null,"• Name of the project"]
[null,null,null,"• Location of the project",null,{"$f":"IF(ISBLANK(E50),\"<<< Reference Required\",\"\")","v":"<<< Reference Required"},null,1]
[null,null,null,"• Project type, size and technology",null,"<<< Reference Required",null,1]
[null,null,null,"• Commercial operation date",null,"<<< Reference Required",null,1]
[null,null,null,"• Capacity factor of the unit for the past three years",null,"<<< Reference Required",null,1]
[null,null,null,"• Availability factor of the unit for the past three years",null,"<<< Reference Required",null,1]
[null,null,null,"• References, including the names and current addresses and telephone numbers of individuals to contact for each reference.",null,"<<< Reference Required",null,1]
[null,null,"A3-e. With regard to the Seller’s project team, identify and describe the entity responsible for the following:",null,null,"<<< Reference Required",null,1]
[null,null,null,"• Construction Period Lender"]
[null,null,null,"• Operating Period Lender",null,{"$f":"IF(ISBLANK(E58),\"<<< Reference Required\",\"\")","v":"<<< Reference Required"},null,1]
[null,null,null,"• Financial Advisor",null,"<<< Reference Required",null,1]
[null,null,null,"• Environmental Consultant",null,"<<< Reference Required",null,1]
[null,null,null,"• Owner’s Engineer",null,"<<< Reference Required",null,1]
[null,null,null,"• Construction Contractor",null,"<<< Reference Required",null,1]
[null,null,null,"• Transmission Consultant",null,"<<< Reference Required",null,1]
[null,null,null,"• Legal Counsel",null,"<<< Reference Required",null,1]
[null,"A4.  Project Schedule & Commerical Operation Date",null,null,null,"<<< Reference Required",null,1]
[null,"A5.  Status of equipment supply and EPC agreements(3)",null,null,null,"<<< Reference Required",null,1]
[null,"Bidders should provide information about the specific technology or equipment including the track record of the technology and equipment."]
[null,null,"A5-a. Provide a reasonable but preliminary engineering plan which includes the following information:"]
[null,null,null,"• Name of principal engineering firm responsible for facility design"]
[null,null,null,"• Type of generation technology",null,{"$f":"IF(ISBLANK(E70),\"<<< Reference Required\",\"\")","v":"<<< Reference Required"},null,{"$f":"IF(F70=\"<<< Reference Required\",1,0)","v":1}]
[null,null,null,"• Major equipment considered or expected to be used",null,"<<< Reference Required",null,1]
[null,null,null,"• Equipment vendors selected/considered",null,"<<< Reference Required",null,1]
[null,null,null,"• History of equipment operations",null,"<<< Reference Required",null,1]
[null,null,null,"• Equipment procurement strategy",null,"<<< Reference Required",null,1]
[null,null,"A5-b. Provide name of expected key equipment suppliers and information that illustrates and discusses the proposed equipment and technology, lead times for delivery to GPA, and suppliers prior experience with equipment operation in tropical island environments.",null,null,"<<< Reference Required",null,1]
[null,null,"A5-c. Please identify similar equipment by the same manufacturer that are presently in commercial operations including the number installed, installed capacity and estimated generation.",null,null,"<<< Reference Required",null,1]
[null,null,"A5-d. Provide evidence that the technology to be employed for energy production is ready for transfer to the design and construction phases.",null,null,"<<< Reference Required",null,{"$f":"IF(F77=\"<<< Reference Required\",1,0)","v":1}]
[null,null,null,"• Describe the technology to be employed for energy production."]
[null,null,null,"• To the developer’s best knowledge, are there, or have there been any similar plants in commercial operation? If not, i) are there, or have there been, any pilot projects, and ii) please provide evidence that the technology to be employed for energy production has been proven. Such evidence may include copies of studies confirming technical feasibility.",null,{"$f":"IF(ISBLANK(E79),\"<<< Reference Required\",\"\")","v":"<<< Reference Required"},null,1]
[null,null,"A5-e. Please indicate if the Bidder has secured its equipment for the project. If not, identify the long-lead equipment options and describe the timing for securing equipment.",null,null,{"$f":"IF(ISBLANK(E80),\"<<< Reference Required\",\"\")","v":"<<< Reference Required"},null,1]
[null,"A6.  Bidder concurrence to the draft Purchase Power Agreement (5)",null,null,null,{"$f":"IF(ISBLANK(E81),\"<<< Reference Required\",\"\")","v":"<<< Reference Required"},null,1]
["B.  PHYSICAL PROJECT CHARACTERISTICS",null,null,null,null,{"$f":"IF(ISBLANK(E82),\"<<< Reference Required\",\"\")","v":"<<< Reference Required"},null,1]
[null,"B1.  Operating Profile (5)",null,null,null,{"$f":"IF(ISBLANK(E83),\"<<< Reference Required\",\"\")","v":"<<< Reference Required"},null,1]
[null,null,"B1-a.  Conformance with Performance Standards"]
[null,null,"B1-b.  Impacts on System Operations/Stability",null,null,{"$f":"IF(ISBLANK(E85),\"<<< Reference Required\",\"\")","v":"<<< Reference Required"},null,1]
[null,null,"B1-c.  Generation Profile",null,null,{"$f":"IF(ISBLANK(E86),\"<<< Reference Required\",\"\")","v":"<<< Reference Required"},null,1]
[null,null,"B1-d.  Quality of Forecasting and Dispatchability",null,null,{"$f":"IF(ISBLANK(E87),\"<<< Reference Required\",\"\")","v":"<<< Reference Required"},null,1]
[null,null,"B1-e.  O&M Plan and Coordination of Maintenance",null,null,{"$f":"IF(ISBLANK(E88),\"<<< Reference Required\",\"\")","v":"<<< Reference Required"},null,1]
[null,null,null,"• Provide an operation and maintenance plan for the project that demonstrates the long term operational viability of the proposed project. The plan should include a discussion of the staffing levels proposed for the project, the expected role of the project sponsor or outside contractor, scheduling of major maintenance activity, maintenance funding levels, and the plan for testing equipment."]
[null,null,null,"• Indicate whether or not the project sponsor is willing to coordinate the maintenance schedule for the project with the annual maintenance schedule of GPA.",null,{"$f":"IF(ISBLANK(E90),\"<<< Reference Required\",\"\")","v":"<<< Reference Required"},null,1]
[null,null,null,"• Describe the status of the project sponsor in securing any operation and maintenance agreements or contracts. Include a discussion of the sponsors plan for securing a long-term O&M contract.",null,{"$f":"IF(ISBLANK(E91),\"<<< Reference Required\",\"\")","v":"<<< Reference Required"},null,1]
[null,null,null,"• Provide examples of the Bidder’s experience with O&M services for other similar projects.",null,{"$f":"IF(ISBLANK(E92),\"<<< Reference Required\",\"\")","v":"<<< Reference Required"},null,1]
[null,"B2.  Point of delivery (5)",null,null,null,{"$f":"IF(ISBLANK(E93),\"<<< Reference Required\",\"\")","v":"<<< Reference Required"},null,1]
[null,null,"B2-a. Provide preliminary Single-Line Diagram(s) for the generation and interconnection facilities (see Appendix H for required details)"]
[null,null,"B2-b. Provide a plan map of the facilities; indicate the interconnection point to the GPA system.",null,null,{"$f":"IF(ISBLANK(E95),\"<<< Reference Required\",\"\")","v":"<<< Reference Required"},null,1]
[null,null,"B2-c. Provide the technical specifications and other information available for the generators included in the proposal.",null,null,{"$f":"IF(ISBLANK(E96),\"<<< Reference Required\",\"\")","v":"<<< Reference Required"},null,1]
[null,"B3.  Risk that the resource will not perform as expected (5)",null,null,null,{"$f":"IF(ISBLANK(E97),\"<<< Reference Required\",\"\")","v":"<<< Reference Required"},null,1]
[null,null,"Discuss risks and plans associated with resource performance."]
[null,"B4.  Project life and extension options. (5)",null,null,null,{"$f":"IF(ISBLANK(E99),\"<<< Reference Required\",\"\")","v":"<<< Reference Required"},null,1]
[null,null,"Describe willingness to allow GPA to extend the life of a resource beyond the initial term or forecast provide potential future risk mitigation. As a result, proposals that provide rights to long-term access to the resource or energy supply will be scored higher than proposals that do not provide similar rights . "]
["C.  POWER PRODUCT CHARACTERISTICS",null,null,null,null,{"$f":"IF(ISBLANK(E101),\"<<< Reference Required\",\"\")","v":"<<< Reference Required"},null,1]
[null,"C1.  Guaranteed Annual MWH (3)"]
[null,"C2.  Dispatchability (3)",null,null,null,{"$f":"IF(ISBLANK(E103),\"<<< Reference Required\",\"\")","v":"<<< Reference Required"},null,1]
[null,"C3.  Product flexibility (3)",null,null,null,{"$f":"IF(ISBLANK(E104),\"<<< Reference Required\",\"\")","v":"<<< Reference Required"},null,1]
[null,null,"C3-a.  Discuss In-service date (GPA prefers projects that reasonably propose a commercial operation date in the 2022-2023 timeframe)"]
[null,null,"C3-b.  Willingness to accept contract provisions for flexibility to accommodate future changes to performance standards.",null,null,{"$f":"IF(ISBLANK(E106),\"<<< Reference Required\",\"\")","v":"<<< Reference Required"},null,1]
[null,null,"C3-c.  Bid size (GPA may prefer contracts in an output range sufficient to allow GPA to contract with more than one project entity to diversify project risk).",null,null,{"$f":"IF(ISBLANK(E107),\"<<< Reference Required\",\"\")","v":"<<< Reference Required"},null,1]
[null,"C4.  Contract term (1)",null,null,null,{"$f":"IF(ISBLANK(E108),\"<<< Reference Required\",\"\")","v":"<<< Reference Required"},null,1]
[null,null,"Discuss contract term.  (NOTE:  No firm capacity payments will be offered for this BID. GPA prefers proposals that have a longer contractual term.)"]
["D.  CREDIT EVALUATION",null,null,null,null,{"$f":"IF(ISBLANK(E110),\"<<< Reference Required\",\"\")","v":"<<< Reference Required"},null,1]
[null,"D1.  Debt and equity ratings (3)"]
[null,"D2.  Performance assurance (3)",null,null,null,{"$f":"IF(ISBLANK(E112),\"<<< Reference Required\",\"\")","v":"<<< Reference Required"},null,1]
[null,"D3.  Financial ratio analysis (3)",null,null,null,"<<< Reference Required",null,1]
[null,"D4.  Default risk (3)",null,null,null,"<<< Reference Required",null,1]
[null,"D5.  Credit concentration and liquidity effect (3)",null,null,null,"<<< Reference Required",null,1]
[null,"D6.  Enforceability of contractual credit terms (3)",null,null,null,"<<< Reference Required",null,1]
[null,"D7.  Bidder revisions to contract templates that may affect credit requirements (3)",null,null,null,"<<< Reference Required",null,1]
["E.  Environmental Permits and Impacts",null,null,null,null,"<<< Reference Required",null,{"$f":"IF(F118=\"<<< Reference Required\",1,0)","v":1}]
[null,"The Bidder should identify environmental impacts associated with the proposed project and its plan to mitigate such impacts. Included in this section are technical environmental issues associated with air, water, solid waste, land use, noise, and other environmental issues. The following addresses specific environmental permitting considerations,"]
[null,"E1.  Permits (5)"]
[null,null,"E1-a.  Identify all permits, licenses, and environmental assessments and/or environmental impact statements required."]
[null,null,"E1-b.  Provide a list of all Federal and GUAM permits, licenses, and environmental assessments and/or environmental impact statements required to construct and operate the project. Identify governmental agencies for issuing permits and licenses.",null,null,{"$f":"IF(ISBLANK(E122),\"<<< Reference Required\",\"\")","v":"<<< Reference Required"},null,1]
[null,null,"E1-c.  Identify the governmental agencies which will issue or approve the required permits, licenses, and environmental assessments and/or environmental impact statements. Prepare timeline to complete acquisition of permits, licenses, and environmental assessments and/or environmental impact statements.",null,null,{"$f":"IF(ISBLANK(E123),\"<<< Reference Required\",\"\")","v":"<<< Reference Required"},null,1]
[null,null,"E1-d.  Provide the anticipated timeline for seeking and receiving the required permits, licenses, and environmental assessments and/or environmental impact statements, using the execution date of the power purchase agreement as the starting point. Please include a narrative on the basis for the assumed timeline.",null,null,{"$f":"IF(ISBLANK(E124),\"<<< Reference Required\",\"\")","v":"<<< Reference Required"},null,1]
[null,"E2.  Site Environmental Assessment (10)",null,null,null,{"$f":"IF(ISBLANK(E125),\"<<< Reference Required\",\"\")","v":"<<< Reference Required"},null,1]
[null,null,"Discuss proposed actions to address environmental issues stated in the Navy Environmental Assessment including "]
[null,null,null,"• Site development"]
[null,null,null,"• Air quality",null,{"$f":"IF(ISBLANK(E128),\"<<< Reference Required\",\"\")","v":"<<< Reference Required"},null,1]
[null,null,null,"• Water resources",null,"<<< Reference Required",null,1]
[null,null,null,"• Ecology",null,"<<< Reference Required",null,{"$f":"IF(F130=\"<<< Reference Required\",1,0)","v":1}]
[null,null,null,"• Land use",null,"<<< Reference Required",null,1]
[null,null,null,"• Cultural resources",null,"<<< Reference Required",null,1]
[null,null,null,"• Previous site use",null,"<<< Reference Required",null,1]
[null,null,null,"• Noise level",null,"<<< Reference Required",null,1]
[null,null,null,"• Aesthetic/visual",null,"<<< Reference Required",null,1]
[null,null,"E2-b.  Identify a community support and a communications plan to gain support for or acceptance of the proposed project. Identify support for and/or acceptance of the proposed project by the affected communities and the general public.",null,null,"<<< Reference Required",null,{"$f":"IF(F136=\"<<< Reference Required\",1,0)","v":1}]
[null,null,null,"• Identify communities and other stakeholders that may be affected by the proposed project. How will they be affected?"]
[null,null,null,"• How will affected communities and the general public be informed about the proposed project?",null,{"$f":"IF(ISBLANK(E138),\"<<< Reference Required\",\"\")","v":"<<< Reference Required"},null,1]
[null,null,null,"• Will the affected communities and the general public be given an opportunity to provide the developer with feedback and comments on the proposed project? What will the developer do with the feedback and comments received?",null,{"$f":"IF(ISBLANK(E139),\"<<< Reference Required\",\"\")","v":"<<< Reference Required"},null,1]
["<<<<<<<<<<   END   >>>>>>>>>>",null,null,null,null,null,null,{"$f":"SUM(H8:H139)","v":99}]

{"sheet":"Part 2 - Technical Data","index":2,"n_rows":872,"n_cols":35,"rows_kept":872,"cut":false,"hidden":false,"merged":[[111,9,111,24],[118,3,119,29],[59,3,59,14],[67,6,67,7],[67,11,67,12],[67,16,67,17],[68,6,68,7],[68,11,68,12],[68,16,68,17],[60,6,60,7],[60,11,60,12],[60,16,60,17],[61,6,61,7],[61,11,61,12],[61,16,61,17],[62,6,62,7],[62,11,62,12],[89,16,89,17],[62,16,62,17],[63,6,63,7],[63,11,63,12],[63,16,63,17],[64,6,64,7],[64,11,64,12],[64,16,64,17],[65,6,65,7],[65,11,65,12],[65,16,65,17],[66,6,66,7],[66,11,66,12],[66,16,66,17],[69,6,69,7],[69,11,69,12],[69,16,69,17],[78,16,78,17],[79,16,79,17],[80,16,80,17],[81,16,81,17],[82,16,82,17],[83,16,83,17],[84,16,84,17],[85,16,85,17],[86,16,86,17],[87,16,87,17],[88,16,88,17],[90,16,90,17],[91,16,91,17],[92,16,92,17],[99,16,99,17],[93,16,93,17],[94,16,94,17],[95,16,95,17],[96,16,96,17],[97,16,97,17],[98,16,98,17],[94,6,94,7],[95,6,95,7],[75,11,75,12],[76,11,76,12],[77,11,77,12],[78,11,78,12],[79,11,79,12],[80,11,80,12],[96,6,96,7],[97,6,97,7],[82,6,82,7],[83,6,83,7],[90,6,90,7],[91,6,91,7],[92,6,92,7],[93,6,93,7],[84,6,84,7],[85,6,85,7],[86,6,86,7],[87,6,87,7],[88,6,88,7],[89,6,89,7],[90,11,90,12],[91,11,91,12],[92,11,92,12],[93,11,93,12],[94,11,94,12],[95,11,95,12],[96,11,96,12],[97,11,97,12],[32,26,32,32],[492,28,492,29],[493,28,493,29],[114,9,114,10],[115,9,115,10],[138,31,138,32],[54,16,54,17],[55,16,55,17],[56,16,56,17],[57,16,57,17],[145,31,145,32],[146,31,146,32],[139,31,139,32],[140,31,140,32],[141,31,141,32],[142,31,142,32],[143,31,143,32],[144,31,144,32],[99,11,99,12],[75,16,75,17],[76,16,76,17],[77,16,77,17],[85,11,85,12],[86,11,86,12],[87,11,87,12],[88,11,88,12],[89,11,89,12],[81,11,81,12],[82,11,82,12],[83,11,83,12],[84,11,84,12],[98,11,98,12],[50,16,50,17],[51,16,51,17],[52,16,52,17],[53,16,53,17],[52,6,52,7],[54,6,54,7],[55,6,55,7],[56,6,56,7],[57,6,57,7],[54,11,54,12],[55,11,55,12],[56,11,56,12],[57,11,57,12],[103,10,103,11],[104,10,104,11],[490,28,490,29],[491,28,491,29],[107,9,107,24],[108,9,108,24],[109,9,109,24],[110,9,110,24],[488,9,488,10],[488,18,488,19],[75,6,75,7],[76,6,76,7],[77,6,77,7],[78,6,78,7],[79,6,79,7],[98,6,98,7],[99,6,99,7],[80,6,80,7],[81,6,81,7],[21,3,21,8],[22,3,22,8],[23,3,23,8],[3,1,3,32],[10,6,10,16],[11,6,11,16],[12,6,12,16],[10,21,10,31],[11,21,11,31],[12,21,12,31],[7,6,7,31],[17,6,17,16],[13,21,13,31],[14,21,14,31],[15,21,15,31],[16,21,16,31],[17,21,17,31],[13,6,13,16],[14,6,14,16],[15,6,15,16],[16,6,16,16],[128,31,128,32],[129,31,129,32],[125,31,125,32],[46,11,46,12],[45,11,45,12],[137,31,137,32],[130,31,130,32],[131,31,131,32],[132,31,132,32],[133,31,133,32],[49,16,49,17],[42,3,42,10],[46,3,46,10],[47,3,47,10],[44,3,44,10],[45,3,45,10],[49,6,49,7],[43,3,43,10],[42,11,42,12],[43,11,43,12],[50,6,50,7],[51,6,51,7],[48,11,48,12],[49,11,49,12],[50,11,50,12],[51,11,51,12],[48,6,48,7],[48,16,48,17],[53,6,53,7],[52,11,52,12],[53,11,53,12],[45,14,45,15],[151,31,151,32],[152,31,152,32],[153,31,153,32],[154,31,154,32],[149,31,149,32],[150,31,150,32],[20,9,20,17],[21,9,21,17],[22,9,22,17],[23,9,23,17],[24,9,24,17],[25,9,25,17],[39,16,39,22],[35,6,35,12],[24,3,24,8],[25,3,25,8],[32,6,32,12],[147,31,147,32],[148,31,148,32],[36,6,36,12],[38,26,38,32],[33,16,33,22],[37,6,37,12],[38,6,38,12],[32,16,32,22],[33,6,33,12],[44,11,44,12],[134,31,134,32],[135,31,135,32],[136,31,136,32],[126,31,126,32],[127,31,127,32],[171,31,171,32],[172,31,172,32],[173,31,173,32],[174,31,174,32],[167,31,167,32],[168,31,168,32],[169,31,169,32],[170,31,170,32],[163,31,163,32],[164,31,164,32],[165,31,165,32],[166,31,166,32],[159,31,159,32],[160,31,160,32],[161,31,161,32],[162,31,162,32],[155,31,155,32],[156,31,156,32],[157,31,157,32],[158,31,158,32],[191,31,191,32],[192,31,192,32],[193,31,193,32],[194,31,194,32],[187,31,187,32],[188,31,188,32],[189,31,189,32],[190,31,190,32],[183,31,183,32],[184,31,184,32],[185,31,185,32],[186,31,186,32],[179,31,179,32],[180,31,180,32],[181,31,181,32],[182,31,182,32],[175,31,175,32],[176,31,176,32],[177,31,177,32],[178,31,178,32],[211,31,211,32],[212,31,212,32],[213,31,213,32],[214,31,214,32],[207,31,207,32],[208,31,208,32],[209,31,209,32],[210,31,210,32],[203,31,203,32],[204,31,204,32],[205,31,205,32],[206,31,206,32],[199,31,199,32],[200,31,200,32],[201,31,201,32],[202,31,202,32],[195,31,195,32],[196,31,196,32],[197,31,197,32],[198,31,198,32],[231,31,231,32],[232,31,232,32],[233,31,233,32],[234,31,234,32],[227,31,227,32],[228,31,228,32],[229,31,229,32],[230,31,230,32],[223,31,223,32],[224,31,224,32],[225,31,225,32],[226,31,226,32],[219,31,219,32],[220,31,220,32],[221,31,221,32],[222,31,222,32],[215,31,215,32],[216,31,216,32],[217,31,217,32],[218,31,218,32],[251,31,251,32],[252,31,252,32],[253,31,253,32],[254,31,254,32],[247,31,247,32],[248,31,248,32],[249,31,249,32],[250,31,250,32],[243,31,243,32],[244,31,244,32],[245,31,245,32],[246,31,246,32],[239,31,239,32],[240,31,240,32],[241,31,241,32],[242,31,242,32],[235,31,235,32],[236,31,236,32],[237,31,237,32],[238,31,238,32],[271,31,271,32],[272,31,272,32],[273,31,273,32],[274,31,274,32],[267,31,267,32],[268,31,268,32],[269,31,269,32],[270,31,270,32],[263,31,263,32],[264,31,264,32],[265,31,265,32],[266,31,266,32],[259,31,259,32],[260,31,260,32],[261,31,261,32],[262,31,262,32],[255,31,255,32],[256,31,256,32],[257,31,257,32],[258,31,258,32],[291,31,291,32],[292,31,292,32],[293,31,293,32],[294,31,294,32],[287,31,287,32],[288,31,288,32],[289,31,289,32],[290,31,290,32],[283,31,283,32],[284,31,284,32],[285,31,285,32],[286,31,286,32],[279,31,279,32],[280,31,280,32],[281,31,281,32],[282,31,282,32],[275,31,275,32],[276,31,276,32],[277,31,277,32],[278,31,278,32],[311,31,311,32],[312,31,312,32],[313,31,313,32],[314,31,314,32],[307,31,307,32],[308,31,308,32],[309,31,309,32],[310,31,310,32],[303,31,303,32],[304,31,304,32],[305,31,305,32],[306,31,306,32],[299,31,299,32],[300,31,300,32],[301,31,301,32],[302,31,302,32],[295,31,295,32],[296,31,296,32],[297,31,297,32],[298,31,298,32],[331,31,331,32],[332,31,332,32],[333,31,333,32],[334,31,334,32],[327,31,327,32],[328,31,328,32],[329,31,329,32],[330,31,330,32],[323,31,323,32],[324,31,324,32],[325,31,325,32],[326,31,326,32],[319,31,319,32],[320,31,320,32],[321,31,321,32],[322,31,322,32],[315,31,315,32],[316,31,316,32],[317,31,317,32],[318,31,318,32],[351,31,351,32],[352,31,352,32],[353,31,353,32],[354,31,354,32],[347,31,347,32],[348,31,348,32],[349,31,349,32],[350,31,350,32],[343,31,343,32],[344,31,344,32],[345,31,345,32],[346,31,346,32],[339,31,339,32],[340,31,340,32],[341,31,341,32],[342,31,342,32],[335,31,335,32],[336,31,336,32],[337,31,337,32],[338,31,338,32],[371,31,371,32],[372,31,372,32],[373,31,373,32],[374,31,374,32],[367,31,367,32],[368,31,368,32],[369,31,369,32],[370,31,370,32],[363,31,363,32],[364,31,364,32],[365,31,365,32],[366,31,366,32],[359,31,359,32],[360,31,360,32],[361,31,361,32],[362,31,362,32],[355,31,355,32],[356,31,356,32],[357,31,357,32],[358,31,358,32],[391,31,391,32],[392,31,392,32],[393,31,393,32],[394,31,394,32],[387,31,387,32],[388,31,388,32],[389,31,389,32],[390,31,390,32],[383,31,383,32],[384,31,384,32],[385,31,385,32],[386,31,386,32],[379,31,379,32],[380,31,380,32],[381,31,381,32],[382,31,382,32],[375,31,375,32],[376,31,376,32],[377,31,377,32],[378,31,378,32],[411,31,411,32],[412,31,412,32],[413,31,413,32],[414,31,414,32],[407,31,407,32],[408,31,408,32],[409,31,409,32],[410,31,410,32],[403,31,403,32],[404,31,404,32],[405,31,405,32],[406,31,406,32],[399,31,399,32],[400,31,400,32],[401,31,401,32],[402,31,402,32],[395,31,395,32],[396,31,396,32],[397,31,397,32],[398,31,398,32],[431,31,431,32],[432,31,432,32],[433,31,433,32],[434,31,434,32],[427,31,427,32],[428,31,428,32],[429,31,429,32],[430,31,430,32],[423,31,423,32],[424,31,424,32],[425,31,425,32],[426,31,426,32],[419,31,419,32],[420,31,420,32],[421,31,421,32],[422,31,422,32],[415,31,415,32],[416,31,416,32],[417,31,417,32],[418,31,418,32],[451,31,451,32],[452,31,452,32],[453,31,453,32],[454,31,454,32],[447,31,447,32],[448,31,448,32],[449,31,449,32],[450,31,450,32],[443,31,443,32],[444,31,444,32],[445,31,445,32],[446,31,446,32],[439,31,439,32],[440,31,440,32],[441,31,441,32],[442,31,442,32],[435,31,435,32],[436,31,436,32],[437,31,437,32],[438,31,438,32],[471,31,471,32],[472,31,472,32],[473,31,473,32],[474,31,474,32],[467,31,467,32],[468,31,468,32],[469,31,469,32],[470,31,470,32],[463,31,463,32],[464,31,464,32],[465,31,465,32],[466,31,466,32],[459,31,459,32],[460,31,460,32],[461,31,461,32],[462,31,462,32],[455,31,455,32],[456,31,456,32],[457,31,457,32],[458,31,458,32],[483,31,483,32],[484,31,484,32],[485,31,485,32],[489,28,489,29],[488,28,488,29],[479,31,479,32],[480,31,480,32],[481,31,481,32],[482,31,482,32],[475,31,475,32],[476,31,476,32],[477,31,477,32],[478,31,478,32],[488,11,488,12],[489,11,489,12],[490,11,490,12],[489,7,489,8],[489,16,489,17],[489,26,489,27],[492,9,492,10],[491,18,491,19],[492,18,492,19],[496,18,496,19],[493,16,493,17],[494,16,494,17],[493,18,493,19],[494,18,494,19],[491,16,491,17],[490,7,490,8],[490,16,490,17],[490,26,490,27],[489,9,489,10],[490,9,490,10],[489,18,489,19],[490,18,490,19],[494,9,494,10],[492,16,492,17],[493,11,493,12],[497,7,497,8],[497,16,497,17],[497,26,497,27],[498,7,498,8],[498,16,498,17],[498,26,498,27],[497,9,497,10],[498,9,498,10],[497,18,497,19],[498,18,498,19],[495,7,495,8],[495,16,495,17],[495,26,495,27],[496,7,496,8],[496,16,496,17],[496,26,496,27],[495,9,495,10],[496,9,496,10],[495,18,495,19],[517,31,517,32],[518,31,518,32],[519,31,519,32],[520,31,520,32],[513,31,513,32],[514,31,514,32],[515,31,515,32],[516,31,516,32],[509,31,509,32],[510,31,510,32],[511,31,511,32],[512,31,512,32],[508,31,508,32],[496,30,496,31],[497,30,497,31],[498,30,498,31],[488,26,488,27],[495,28,495,29],[492,26,492,27],[498,28,498,29],[493,26,493,27],[494,26,494,27],[491,26,491,27],[494,28,494,29],[537,31,537,32],[538,31,538,32],[539,31,539,32],[540,31,540,32],[533,31,533,32],[534,31,534,32],[535,31,535,32],[536,31,536,32],[529,31,529,32],[530,31,530,32],[531,31,531,32],[532,31,532,32],[525,31,525,32],[526,31,526,32],[527,31,527,32],[528,31,528,32],[521,31,521,32],[522,31,522,32],[523,31,523,32],[524,31,524,32],[557,31,557,32],[558,31,558,32],[559,31,559,32],[560,31,560,32],[553,31,553,32],[554,31,554,32],[555,31,555,32],[556,31,556,32],[549,31,549,32],[550,31,550,32],[551,31,551,32],[552,31,552,32],[545,31,545,32],[546,31,546,32],[547,31,547,32],[548,31,548,32],[541,31,541,32],[542,31,542,32],[543,31,543,32],[544,31,544,32],[577,31,577,32],[578,31,578,32],[579,31,579,32],[580,31,580,32],[573,31,573,32],[574,31,574,32],[575,31,575,32],[576,31,576,32],[569,31,569,32],[570,31,570,32],[571,31,571,32],[572,31,572,32],[565,31,565,32],[566,31,566,32],[567,31,567,32],[568,31,568,32],[561,31,561,32],[562,31,562,32],[563,31,563,32],[564,31,564,32],[597,31,597,32],[598,31,598,32],[599,31,599,32],[600,31,600,32],[593,31,593,32],[594,31,594,32],[595,31,595,32],[596,31,596,32],[589,31,589,32],[590,31,590,32],[591,31,591,32],[592,31,592,32],[585,31,585,32],[586,31,586,32],[587,31,587,32],[588,31,588,32],[581,31,581,32],[582,31,582,32],[583,31,583,32],[584,31,584,32],[617,31,617,32],[618,31,618,32],[619,31,619,32],[620,31,620,32],[613,31,613,32],[614,31,614,32],[615,31,615,32],[616,31,616,32],[609,31,609,32],[610,31,610,32],[611,31,611,32],[612,31,612,32],[605,31,605,32],[606,31,606,32],[607,31,607,32],[608,31,608,32],[601,31,601,32],[602,31,602,32],[603,31,603,32],[604,31,604,32],[637,31,637,32],[638,31,638,32],[639,31,639,32],[640,31,640,32],[633,31,633,32],[634,31,634,32],[635,31,635,32],[636,31,636,32],[629,31,629,32],[630,31,630,32],[631,31,631,32],[632,31,632,32],[625,31,625,32],[626,31,626,32],[627,31,627,32],[628,31,628,32],[621,31,621,32],[622,31,622,32],[623,31,623,32],[624,31,624,32],[657,31,657,32],[658,31,658,32],[659,31,659,32],[660,31,660,32],[653,31,653,32],[654,31,654,32],[655,31,655,32],[656,31,656,32],[649,31,649,32],[650,31,650,32],[651,31,651,32],[652,31,652,32],[645,31,645,32],[646,31,646,32],[647,31,647,32],[648,31,648,32],[641,31,641,32],[642,31,642,32],[643,31,643,32],[644,31,644,32],[677,31,677,32],[678,31,678,32],[679,31,679,32],[680,31,680,32],[673,31,673,32],[674,31,674,32],[675,31,675,32],[676,31,676,32],[669,31,669,32],[670,31,670,32],[671,31,671,32],[672,31,672,32],[665,31,665,32],[666,31,666,32],[667,31,667,32],[668,31,668,32],[661,31,661,32],[662,31,662,32],[663,31,663,32],[664,31,664,32],[697,31,697,32],[698,31,698,32],[699,31,699,32],[700,31,700,32],[693,31,693,32],[694,31,694,32],[695,31,695,32],[696,31,696,32],[689,31,689,32],[690,31,690,32],[691,31,691,32],[692,31,692,32],[685,31,685,32],[686,31,686,32],[687,31,687,32],[688,31,688,32],[681,31,681,32],[682,31,682,32],[683,31,683,32],[684,31,684,32],[717,31,717,32],[718,31,718,32],[719,31,719,32],[720,31,720,32],[713,31,713,32],[714,31,714,32],[715,31,715,32],[716,31,716,32],[709,31,709,32],[710,31,710,32],[711,31,711,32],[712,31,712,32],[705,31,705,32],[706,31,706,32],[707,31,707,32],[708,31,708,32],[701,31,701,32],[702,31,702,32],[703,31,703,32],[704,31,704,32],[737,31,737,32],[738,31,738,32],[739,31,739,32],[740,31,740,32],[733,31,733,32],[734,31,734,32],[735,31,735,32],[736,31,736,32],[729,31,729,32],[730,31,730,32],[731,31,731,32],[732,31,732,32],[725,31,725,32],[726,31,726,32],[727,31,727,32],[728,31,728,32],[721,31,721,32],[722,31,722,32],[723,31,723,32],[724,31,724,32],[757,31,757,32],[758,31,758,32],[759,31,759,32],[760,31,760,32],[753,31,753,32],[754,31,754,32],[755,31,755,32],[756,31,756,32],[749,31,749,32],[750,31,750,32],[751,31,751,32],[752,31,752,32],[745,31,745,32],[746,31,746,32],[747,31,747,32],[748,31,748,32],[741,31,741,32],[742,31,742,32],[743,31,743,32],[744,31,744,32],[777,31,777,32],[778,31,778,32],[779,31,779,32],[780,31,780,32],[773,31,773,32],[774,31,774,32],[775,31,775,32],[776,31,776,32],[769,31,769,32],[770,31,770,32],[771,31,771,32],[772,31,772,32],[765,31,765,32],[766,31,766,32],[767,31,767,32],[768,31,768,32],[761,31,761,32],[762,31,762,32],[763,31,763,32],[764,31,764,32],[797,31,797,32],[798,31,798,32],[799,31,799,32],[800,31,800,32],[793,31,793,32],[794,31,794,32],[795,31,795,32],[796,31,796,32],[789,31,789,32],[790,31,790,32],[791,31,791,32],[792,31,792,32],[785,31,785,32],[786,31,786,32],[787,31,787,32],[788,31,788,32],[781,31,781,32],[782,31,782,32],[783,31,783,32],[784,31,784,32],[817,31,817,32],[818,31,818,32],[819,31,819,32],[820,31,820,32],[813,31,813,32],[814,31,814,32],[815,31,815,32],[816,31,816,32],[809,31,809,32],[810,31,810,32],[811,31,811,32],[812,31,812,32],[805,31,805,32],[806,31,806,32],[807,31,807,32],[808,31,808,32],[801,31,801,32],[802,31,802,32],[803,31,803,32],[804,31,804,32],[840,31,840,32],[833,31,833,32],[834,31,834,32],[835,31,835,32],[836,31,836,32],[829,31,829,32],[830,31,830,32],[831,31,831,32],[832,31,832,32],[825,31,825,32],[826,31,826,32],[827,31,827,32],[828,31,828,32],[821,31,821,32],[822,31,822,32],[823,31,823,32],[824,31,824,32],[865,31,865,32],[866,31,866,32],[867,31,867,32],[868,31,868,32],[861,31,861,32],[862,31,862,32],[863,31,863,32],[864,31,864,32],[857,31,857,32],[858,31,858,32],[859,31,859,32],[860,31,860,32],[853,31,853,32],[854,31,854,32],[855,31,855,32],[856,31,856,32],[849,31,849,32],[850,31,850,32],[851,31,851,32],[852,31,852,32],[845,31,845,32],[846,31,846,32],[847,31,847,32],[848,31,848,32],[841,31,841,32],[842,31,842,32],[843,31,843,32],[844,31,844,32],[837,31,837,32],[838,31,838,32],[839,31,839,32],[492,7,492,8],[491,9,491,10],[498,20,498,21],[488,30,488,31],[489,30,489,31],[490,30,490,31],[491,30,491,31],[492,30,492,31],[493,30,493,31],[494,30,494,31],[495,30,495,31],[496,28,496,29],[498,11,498,12],[488,20,488,21],[489,20,489,21],[490,20,490,21],[491,20,491,21]],"merged_total":1036,"flags":["merged_cut"]}
["Invitation for Bid: GPA-012-23"]
["Renewable Energy Resource Acquisition for the Guam Power Authority (Phase IV)"]
["PART 2 - TECHNICAL DATA"]
[]
[null,{"$f":" CONCATENATE(\"BIDDER:  \",'Workbook Instructions'!A6)","v":"BIDDER:  "},null,null,null,null,null,null,null,null,null,null,null,null,null,null,null,{"$f":" CONCATENATE(\"PROJECT NAME.:  \",J21)","v":"PROJECT NAME.:  <<<project name>>>"},null,null,null,null,null,null,null,null,{"$f":"CONCATENATE(\"BIDDER'S NO.:  \",'Workbook Instructions'!A9)","v":"BIDDER'S NO.:  <<< BIDDER'S BID NO >>>"}]
[]
[null,null,null,"Bidder Information"]
[null,"1.",null,"Company Name:"]
[]
[null,null,null,"Primary Contact:",null,null,null,null,null,null,null,null,null,null,null,null,null,null,"Alternative Contact:"]
[null,"2.",null,"Contact Name:",null,null,null,null,null,null,null,null,null,null,null,null,null,null,"Contact Name:"]
[null,null,null,"Company Name:",null,null,null,null,null,null,null,null,null,null,null,null,null,null,"Company Name:"]
[null,null,null,"Street Address:",null,null,null,null,null,null,null,null,null,null,null,null,null,null,"Street Address:"]
[null,null,null,"City:",null,null,null,null,null,null,null,null,null,null,null,null,null,null,"City:"]
[null,null,null,"State & Zip Code: ",null,null,null,null,null,null,null,null,null,null,null,null,null,null,"State & Zip Code: "]
[null,null,null,"Phone Number:",null,null,null,null,null,null,null,null,null,null,null,null,null,null,"Phone Number:"]
[null,null,null,"Fax Number:",null,null,null,null,null,null,null,null,null,null,null,null,null,null,"Fax Number:"]
[null,null,null,"e-mail Address:",null,null,null,null,null,null,null,null,null,null,null,null,null,null,"e-mail Address:"]
[]
[null,null,null,"Renewable Energy Project Information"]
[null,"3.",null,"Project Name:",null,null,null,null,null,"<<<project name>>>"]
[null,"4.",null,"Unique Bid Number (1,2,3…):",null,null,null,null,null,{"$f":"+'Workbook Instructions'!A9","v":"<<< BIDDER'S BID NO >>>"}]
[null,"5.",null,"Renewable Technology (Select one):",null,null,null,null,null,"<renewable technology>"]
[null,"6.",null,"Street Address (or general location):"]
[null,null,null,"City / County:"]
[null,null,null,"State & Zip Code:"]
[]
[null,"7.",null,"New or existing? (Click One Below)"]
[null,null,null,null,null,"Existing Facility"]
[null,null,null,null,null,"New Facility"]
[]
[null,"8.",null,"Project Owners"]
[null,null,null,"Owner 1:",null,null,null,null,null,null,null,null,null,"Owner 2:",null,null,null,null,null,null,null,null,null,"Owner 3:"]
[null,null,null,"Contact:",null,null,null,null,null,null,null,null,null,"Contact:",null,null,null,null,null,null,null,null,null,"Contact:"]
[null,null,null,"Street Address:",null,null,null,null,null,null,null,null,null,"Street Address:",null,null,null,null,null,null,null,null,null,"Street Address:"]
[null,null,null,"City:",null,null,null,null,null,null,null,null,null,"City:",null,null,null,null,null,null,null,null,null,"City:"]
[null,null,null,"State & Zip Code:",null,null,null,null,null,null,null,null,null,"State & Zip Code:",null,null,null,null,null,null,null,null,null,"State & Zip Code:"]
[null,null,null,"Phone Number:",null,null,null,null,null,null,null,null,null,"Phone Number:",null,null,null,null,null,null,null,null,null,"Phone Number:"]
[null,null,null,"e-mail Address:",null,null,null,null,null,null,null,null,null,"e-mail Address:",null,null,null,null,null,null,null,null,null,"e-mail Address:"]
[null,null,null,"Ownership Share:",null,null,null,null,null,null,null,null,null,"Ownership Share:",null,null,null,null,null,null,null,null,null,"Ownership Share:"]
[]
[null,"9.",null,"Project Technical Information"]
[null,"9.A",null,"Date of Initial Operation, (MM/DD/YYYY):",null,null,null,null,null,null,null,null,null,null,"<< This is the date when the facility will initiate operation mainly for testing"]
[null,"9.B",null,"Agreement Beginning Date, (MM/DD/YYYY): ",null,null,null,null,null,null,null,"2022-01-01",null,null,"<< This is the Commercial Operation Date"]
[null,"9.C",null,"Nameplate Capacity, kW:"]
[null,"9.D",null,"ESS Capacity (MW and MWh):",null,null,null,null,null,null,null,null,null,"KW",null,null,"KWH","<< This will be used for dispatching solar energy production for evaluation purposes."]
[null,"9.E",null,"Estimated Annual Capacity Factor (net), %:"]
[null,"9.F",null,"Guaranteed Net Annual Generation, MWh/yr:"]
[null,null,null,null,null,"Contract Year:  1",null,null,null,null,"Contract Year:  11",null,null,null,null,"Contract Year:  21"]
[null,null,null,null,null,2,null,null,null,null,12,null,null,null,null,22]
[null,null,null,null,null,3,null,null,null,null,13,null,null,null,null,23]
[null,null,null,null,null,4,null,null,null,null,14,null,null,null,null,24]
[null,null,null,null,null,5,null,null,null,null,15,null,null,null,null,25]
[null,null,null,null,null,6,null,null,null,null,16]
[null,null,null,null,null,7,null,null,null,null,17]
[null,null,null,null,null,8,null,null,null,null,18]
[null,null,null,null,null,9,null,null,null,null,19]
[null,null,null,null,null,10,null,null,null,null,20]
[]
[null,"9.G",null,"Expected Minimum Annual Generation, MWh/yr at 95% Confidence Level:"]
[null,null,null,null,null,"Contract Year:  1",null,null,null,null,"Contract Year:  11",null,null,null,null,"Contract Year:  21"]
[null,null,null,null,null,2,null,null,null,null,12,null,null,null,null,22]
[null,null,null,null,null,3,null,null,null,null,13,null,null,null,null,23]
[null,null,null,null,null,4,null,null,null,null,14,null,null,null,null,24]
[null,null,null,null,null,5,null,null,null,null,15,null,null,null,null,25]
[null,null,null,null,null,6,null,null,null,null,16]
[null,null,null,null,null,7,null,null,null,null,17]
[null,null,null,null,null,8,null,null,null,null,18]
[null,null,null,null,null,9,null,null,null,null,19]
[null,null,null,null,null,10,null,null,null,null,20]
[]
["gpa2009_renew1","9.H",null,"Guaranteed Success rate, AC-AC efficiency and availability for RI-ESS:"]
[null,null,null,null,null,null,"1% Ramp Rate ",null,null,null,null,"Guaranteed",null,null,null,null,"Guaranteed"]
[null,null,null,null,null,null,"Guaranteed Success",null,null,null,null,"AC-AC",null,null,null,null,"Availability"]
[null,null,null,null,null,null," Rate",null,null,null,null,"Efficiency"]
[null,null,null,null,null,"Contract Year:  1",null,null,null,null,"Contract Year:  1",null,null,null,null,"Contract Year:  1"]
[null,null,null,null,null,2,null,null,null,null,2,null,null,null,null,2]
[null,null,null,null,null,3,null,null,null,null,3,null,null,null,null,3]
[null,null,null,null,null,4,null,null,null,null,4,null,null,null,null,4]
[null,null,null,null,null,5,null,null,null,null,5,null,null,null,null,5]
[null,null,null,null,null,6,null,null,null,null,6,null,null,null,null,6]
[null,null,null,null,null,7,null,null,null,null,7,null,null,null,null,7]
[null,null,null,null,null,8,null,null,null,null,8,null,null,null,null,8]
[null,null,null,null,null,9,null,null,null,null,9,null,null,null,null,9]
[null,null,null,null,null,10,null,null,null,null,10,null,null,null,null,10]
[null,null,null,null,null,11,null,null,null,null,11,null,null,null,null,11]
[null,null,null,null,null,12,null,null,null,null,12,null,null,null,null,12]
[null,null,null,null,null,13,null,null,null,null,13,null,null,null,null,13]
[null,null,null,null,null,14,null,null,null,null,14,null,null,null,null,14]
[null,null,null,null,null,15,null,null,null,null,15,null,null,null,null,15]
[null,null,null,null,null,16,null,null,null,null,16,null,null,null,null,16]
[null,null,null,null,null,17,null,null,null,null,17,null,null,null,null,17]
[null,null,null,null,null,18,null,null,null,null,18,null,null,null,null,18]
[null,null,null,null,null,19,null,null,null,null,19,null,null,null,null,19]
[null,null,null,null,null,20,null,null,null,null,20,null,null,null,null,20]
[null,null,null,null,null,21,null,null,null,null,21,null,null,null,null,21]
[null,null,null,null,null,22,null,null,null,null,22,null,null,null,null,22]
[null,null,null,null,null,23,null,null,null,null,23,null,null,null,null,23]
[null,null,null,null,null,24,null,null,null,null,24,null,null,null,null,24]
[null,null,null,null,null,25,null,null,null,null,25,null,null,null,null,25]
[]
[]
[]
[null,"9.I",null,"Estimated Equivalent Availability Factor, %:"]
[null,"9.J",null,"Expected Project Life, years:"]
[]
[null,"10.",null,"Interconnection and Transmission Information"]
[null,"10.A",null,"Interconnection Voltage:"]
[null,"10.B",null,"Interconnection Point / Substation:"]
[null,"10.C",null,"Interconnecting Transmission Line:"]
[null,"10.D",null,"Total Interconnection Cost ($):"]
[null,"10.E",null,"Total Interconnection Cost ($/MWH):"]
[]
[null,"11.",null,"Power Purchase Agreement Information"]
[null,"11.A",null,"Term, years:"]
[null,"11.B",null,"Contract Net Capacity, KW:"]
[]
[null,"12.",null,"Renewable Energy Project Generation Profile"]
[null,null,null,"Provide the monthly estimated average net MWh per hour for every hour of the day.  GPA requests for operation profile to evaluate the project.  Annual projections must equal the Guaranteed net annual generation in 9.F above. Data provided shall be the solar production net output (excludes ESS & other losses/meter output).  GPA will use this data to determine total daily production to be dispatched over its peak period (6PM -10PM) based the ESS capacity entered in 9D above."]
[]
[]
[]
[]
[]
[null,null,null,null,null,null,"Hour:"]
[null,null,null,"CON YR","MON","YR",0,1,2,3,4,5,6,7,8,9,10,11,12,13,14,15,16,17,18,19,20,21,22,23,"DAYS","Monthly Total MWh",null,null,"CON YR"]
[null,null,null,1,{"$f":"TEXT(L44,\"MMM\")","v":"Jan"},{"$f":"TEXT(L44,\"yyyy\")","v":"2022"},null,null,null,null,null,null,null,null,null,null,null,null,null,null,null,null,null,null,null,null,null,null,null,null,{"$f":"IF(OR(AND(E127=\"Feb\",OR(F127=2020,OR(F127=2024,OR(F127=2028,OR(F127=2032,OR(F127=2036,F127=2040)))))),AND(E127=\"Feb\",OR(F127=2044,OR(F127=2048,F127=2052)))),29,VLOOKUP(E127,Lookup!$B$2:$C$13,2,FALSE))","v":31},{"$f":"SUM(G127:AD127)*AE127","v":0},null,null,{"$f":"+D127","v":1}]
[null,null,null,1,{"$f":"IF(E127=\"\",\"\",VLOOKUP(E127,Lookup!$A$2:$B$13,2,FALSE))","v":"Feb"},{"$f":"IF(E127=0,\"\",IF(E127=\"Dec\",F127+1,F127))","v":"2022"},null,null,null,null,null,null,null,null,null,null,null,null,null,null,null,null,null,null,null,null,null,null,null,null,{"$f":"IF(OR(AND(E128=\"Feb\",OR(F128=2020,OR(F128=2024,OR(F128=2028,OR(F128=2032,OR(F128=2036,F128=2040)))))),AND(E128=\"Feb\",OR(F128=2044,OR(F128=2048,F128=2052)))),29,VLOOKUP(E128,Lookup!$B$2:$C$13,2,FALSE))","v":28},0,null,null,{"$f":"+D128","v":1}]
[null,null,null,1,{"$f":"IF(E128=\"\",\"\",VLOOKUP(E128,Lookup!$A$2:$B$13,2,FALSE))","v":"Mar"},"2022",null,null,null,null,null,null,null,null,null,null,null,null,null,null,null,null,null,null,null,null,null,null,null,null,{"$f":"IF(OR(AND(E129=\"Feb\",OR(F129=2020,OR(F129=2024,OR(F129=2028,OR(F129=2032,OR(F129=2036,F129=2040)))))),AND(E129=\"Feb\",OR(F129=2044,OR(F129=2048,F129=2052)))),29,VLOOKUP(E129,Lookup!$B$2:$C$13,2,FALSE))","v":31},0,null,null,1]
[null,null,null,1,{"$f":"IF(E129=\"\",\"\",VLOOKUP(E129,Lookup!$A$2:$B$13,2,FALSE))","v":"Apr"},"2022",null,null,null,null,null,null,null,null,null,null,null,null,null,null,null,null,null,null,null,null,null,null,null,null,{"$f":"IF(OR(AND(E130=\"Feb\",OR(F130=2020,OR(F130=2024,OR(F130=2028,OR(F130=2032,OR(F130=2036,F130=2040)))))),AND(E130=\"Feb\",OR(F130=2044,OR(F130=2048,F130=2052)))),29,VLOOKUP(E130,Lookup!$B$2:$C$13,2,FALSE))","v":30},0,null,null,1]
[null,null,null,1,{"$f":"IF(E130=\"\",\"\",VLOOKUP(E130,Lookup!$A$2:$B$13,2,FALSE))","v":"May"},"2022",null,null,null,null,null,null,null,null,null,null,null,null,null,null,null,null,null,null,null,null,null,null,null,null,{"$f":"IF(OR(AND(E131=\"Feb\",OR(F131=2020,OR(F131=2024,OR(F131=2028,OR(F131=2032,OR(F131=2036,F131=2040)))))),AND(E131=\"Feb\",OR(F131=2044,OR(F131=2048,F131=2052)))),29,VLOOKUP(E131,Lookup!$B$2:$C$13,2,FALSE))","v":31},0,null,null,1]
[null,null,null,1,{"$f":"IF(E131=\"\",\"\",VLOOKUP(E131,Lookup!$A$2:$B$13,2,FALSE))","v":"Jun"},"2022",null,null,null,null,null,null,null,null,null,null,null,null,null,null,null,null,null,null,null,null,null,null,null,null,{"$f":"IF(OR(AND(E132=\"Feb\",OR(F132=2020,OR(F132=2024,OR(F132=2028,OR(F132=2032,OR(F132=2036,F132=2040)))))),AND(E132=\"Feb\",OR(F132=2044,OR(F132=2048,F132=2052)))),29,VLOOKUP(E132,Lookup!$B$2:$C$13,2,FALSE))","v":30},0,null,null,1]
[null,null,null,1,{"$f":"IF(E132=\"\",\"\",VLOOKUP(E132,Lookup!$A$2:$B$13,2,FALSE))","v":"Jul"},"2022",null,null,null,null,null,null,null,null,null,null,null,null,null,null,null,null,null,null,null,null,null,null,null,null,{"$f":"IF(OR(AND(E133=\"Feb\",OR(F133=2020,OR(F133=2024,OR(F133=2028,OR(F133=2032,OR(F133=2036,F133=2040)))))),AND(E133=\"Feb\",OR(F133=2044,OR(F133=2048,F133=2052)))),29,VLOOKUP(E133,Lookup!$B$2:$C$13,2,FALSE))","v":31},0,null,null,1]
[null,null,null,1,{"$f":"IF(E133=\"\",\"\",VLOOKUP(E133,Lookup!$A$2:$B$13,2,FALSE))","v":"Aug"},"2022",null,null,null,null,null,null,null,null,null,null,null,null,null,null,null,null,null,null,null,null,null,null,null,null,{"$f":"IF(OR(AND(E134=\"Feb\",OR(F134=2020,OR(F134=2024,OR(F134=2028,OR(F134=2032,OR(F134=2036,F134=2040)))))),AND(E134=\"Feb\",OR(F134=2044,OR(F134=2048,F134=2052)))),29,VLOOKUP(E134,Lookup!$B$2:$C$13,2,FALSE))","v":31},0,null,null,1]
[null,null,null,1,{"$f":"IF(E134=\"\",\"\",VLOOKUP(E134,Lookup!$A$2:$B$13,2,FALSE))","v":"Sep"},"2022",null,null,null,null,null,null,null,null,null,null,null,null,null,null,null,null,null,null,null,null,null,null,null,null,{"$f":"IF(OR(AND(E135=\"Feb\",OR(F135=2020,OR(F135=2024,OR(F135=2028,OR(F135=2032,OR(F135=2036,F135=2040)))))),AND(E135=\"Feb\",OR(F135=2044,OR(F135=2048,F135=2052)))),29,VLOOKUP(E135,Lookup!$B$2:$C$13,2,FALSE))","v":30},0,null,null,1]
[null,null,null,1,{"$f":"IF(E135=\"\",\"\",VLOOKUP(E135,Lookup!$A$2:$B$13,2,FALSE))","v":"Oct"},"2022",null,null,null,null,null,null,null,null,null,null,null,null,null,null,null,null,null,null,null,null,null,null,null,null,{"$f":"IF(OR(AND(E136=\"Feb\",OR(F136=2020,OR(F136=2024,OR(F136=2028,OR(F136=2032,OR(F136=2036,F136=2040)))))),AND(E136=\"Feb\",OR(F136=2044,OR(F136=2048,F136=2052)))),29,VLOOKUP(E136,Lookup!$B$2:$C$13,2,FALSE))","v":31},0,null,null,1]
[null,null,null,1,{"$f":"IF(E136=\"\",\"\",VLOOKUP(E136,Lookup!$A$2:$B$13,2,FALSE))","v":"Nov"},"2022",null,null,null,null,null,null,null,null,null,null,null,null,null,null,null,null,null,null,null,null,null,null,null,null,{"$f":"IF(OR(AND(E137=\"Feb\",OR(F137=2020,OR(F137=2024,OR(F137=2028,OR(F137=2032,OR(F137=2036,F137=2040)))))),AND(E137=\"Feb\",OR(F137=2044,OR(F137=2048,F137=2052)))),29,VLOOKUP(E137,Lookup!$B$2:$C$13,2,FALSE))","v":30},0,null,null,1]
[null,null,null,1,{"$f":"IF(E137=\"\",\"\",VLOOKUP(E137,Lookup!$A$2:$B$13,2,FALSE))","v":"Dec"},"2022",null,null,null,null,null,null,null,null,null,null,null,null,null,null,null,null,null,null,null,null,null,null,null,null,{"$f":"IF(OR(AND(E138=\"Feb\",OR(F138=2020,OR(F138=2024,OR(F138=2028,OR(F138=2032,OR(F138=2036,F138=2040)))))),AND(E138=\"Feb\",OR(F138=2044,OR(F138=2048,F138=2052)))),29,VLOOKUP(E138,Lookup!$B$2:$C$13,2,FALSE))","v":31},0,null,null,1]
[null,null,null,{"$f":"+D127+1","v":2},{"$f":"IF(E138=\"\",\"\",VLOOKUP(E138,Lookup!$A$2:$B$13,2,FALSE))","v":"Jan"},2023,null,null,null,null,null,null,null,null,null,null,null,null,null,null,null,null,null,null,null,null,null,null,null,null,{"$f":"IF(OR(AND(E139=\"Feb\",OR(F139=2020,OR(F139=2024,OR(F139=2028,OR(F139=2032,OR(F139=2036,F139=2040)))))),AND(E139=\"Feb\",OR(F139=2044,OR(F139=2048,F139=2052)))),29,VLOOKUP(E139,Lookup!$B$2:$C$13,2,FALSE))","v":31},0,null,null,2]
[null,null,null,{"$f":"+D128+1","v":2},{"$f":"IF(E139=\"\",\"\",VLOOKUP(E139,Lookup!$A$2:$B$13,2,FALSE))","v":"Feb"},{"$f":"IF(E139=0,\"\",IF(E139=\"Dec\",F139+1,F139))","v":2023},null,null,null,null,null,null,null,null,null,null,null,null,null,null,null,null,null,null,null,null,null,null,null,null,{"$f":"IF(OR(AND(E140=\"Feb\",OR(F140=2020,OR(F140=2024,OR(F140=2028,OR(F140=2032,OR(F140=2036,F140=2040)))))),AND(E140=\"Feb\",OR(F140=2044,OR(F140=2048,F140=2052)))),29,VLOOKUP(E140,Lookup!$B$2:$C$13,2,FALSE))","v":28},0,null,null,2]
[null,null,null,2,{"$f":"IF(E140=\"\",\"\",VLOOKUP(E140,Lookup!$A$2:$B$13,2,FALSE))","v":"Mar"},2023,null,null,null,null,null,null,null,null,null,null,null,null,null,null,null,null,null,null,null,null,null,null,null,null,{"$f":"IF(OR(AND(E141=\"Feb\",OR(F141=2020,OR(F141=2024,OR(F141=2028,OR(F141=2032,OR(F141=2036,F141=2040)))))),AND(E141=\"Feb\",OR(F141=2044,OR(F141=2048,F141=2052)))),29,VLOOKUP(E141,Lookup!$B$2:$C$13,2,FALSE))","v":31},0,null,null,2]
[null,null,null,2,{"$f":"IF(E141=\"\",\"\",VLOOKUP(E141,Lookup!$A$2:$B$13,2,FALSE))","v":"Apr"},2023,null,null,null,null,null,null,null,null,null,null,null,null,null,null,null,null,null,null,null,null,null,null,null,null,{"$f":"IF(OR(AND(E142=\"Feb\",OR(F142=2020,OR(F142=2024,OR(F142=2028,OR(F142=2032,OR(F142=2036,F142=2040)))))),AND(E142=\"Feb\",OR(F142=2044,OR(F142=2048,F142=2052)))),29,VLOOKUP(E142,Lookup!$B$2:$C$13,2,FALSE))","v":30},0,null,null,2]
[null,null,null,2,{"$f":"IF(E142=\"\",\"\",VLOOKUP(E142,Lookup!$A$2:$B$13,2,FALSE))","v":"May"},2023,null,null,null,null,null,null,null,null,null,null,null,null,null,null,null,null,null,null,null,null,null,null,null,null,{"$f":"IF(OR(AND(E143=\"Feb\",OR(F143=2020,OR(F143=2024,OR(F143=2028,OR(F143=2032,OR(F143=2036,F143=2040)))))),AND(E143=\"Feb\",OR(F143=2044,OR(F143=2048,F143=2052)))),29,VLOOKUP(E143,Lookup!$B$2:$C$13,2,FALSE))","v":31},0,null,null,2]
[null,null,null,2,{"$f":"IF(E143=\"\",\"\",VLOOKUP(E143,Lookup!$A$2:$B$13,2,FALSE))","v":"Jun"},2023,null,null,null,null,null,null,null,null,null,null,null,null,null,null,null,null,null,null,null,null,null,null,null,null,{"$f":"IF(OR(AND(E144=\"Feb\",OR(F144=2020,OR(F144=2024,OR(F144=2028,OR(F144=2032,OR(F144=2036,F144=2040)))))),AND(E144=\"Feb\",OR(F144=2044,OR(F144=2048,F144=2052)))),29,VLOOKUP(E144,Lookup!$B$2:$C$13,2,FALSE))","v":30},0,null,null,2]
[null,null,null,2,{"$f":"IF(E144=\"\",\"\",VLOOKUP(E144,Lookup!$A$2:$B$13,2,FALSE))","v":"Jul"},2023,null,null,null,null,null,null,null,null,null,null,null,null,null,null,null,null,null,null,null,null,null,null,null,null,{"$f":"IF(OR(AND(E145=\"Feb\",OR(F145=2020,OR(F145=2024,OR(F145=2028,OR(F145=2032,OR(F145=2036,F145=2040)))))),AND(E145=\"Feb\",OR(F145=2044,OR(F145=2048,F145=2052)))),29,VLOOKUP(E145,Lookup!$B$2:$C$13,2,FALSE))","v":31},0,null,null,2]
[null,null,null,2,{"$f":"IF(E145=\"\",\"\",VLOOKUP(E145,Lookup!$A$2:$B$13,2,FALSE))","v":"Aug"},2023,null,null,null,null,null,null,null,null,null,null,null,null,null,null,null,null,null,null,null,null,null,null,null,null,{"$f":"IF(OR(AND(E146=\"Feb\",OR(F146=2020,OR(F146=2024,OR(F146=2028,OR(F146=2032,OR(F146=2036,F146=2040)))))),AND(E146=\"Feb\",OR(F146=2044,OR(F146=2048,F146=2052)))),29,VLOOKUP(E146,Lookup!$B$2:$C$13,2,FALSE))","v":31},0,null,null,2]
[null,null,null,2,{"$f":"IF(E146=\"\",\"\",VLOOKUP(E146,Lookup!$A$2:$B$13,2,FALSE))","v":"Sep"},2023,null,null,null,null,null,null,null,null,null,null,null,null,null,null,null,null,null,null,null,null,null,null,null,null,{"$f":"IF(OR(AND(E147=\"Feb\",OR(F147=2020,OR(F147=2024,OR(F147=2028,OR(F147=2032,OR(F147=2036,F147=2040)))))),AND(E147=\"Feb\",OR(F147=2044,OR(F147=2048,F147=2052)))),29,VLOOKUP(E147,Lookup!$B$2:$C$13,2,FALSE))","v":30},0,null,null,2]
[null,null,null,2,{"$f":"IF(E147=\"\",\"\",VLOOKUP(E147,Lookup!$A$2:$B$13,2,FALSE))","v":"Oct"},2023,null,null,null,null,null,null,null,null,null,null,null,null,null,null,null,null,null,null,null,null,null,null,null,null,{"$f":"IF(OR(AND(E148=\"Feb\",OR(F148=2020,OR(F148=2024,OR(F148=2028,OR(F148=2032,OR(F148=2036,F148=2040)))))),AND(E148=\"Feb\",OR(F148=2044,OR(F148=2048,F148=2052)))),29,VLOOKUP(E148,Lookup!$B$2:$C$13,2,FALSE))","v":31},0,null,null,2]
[null,null,null,2,{"$f":"IF(E148=\"\",\"\",VLOOKUP(E148,Lookup!$A$2:$B$13,2,FALSE))","v":"Nov"},2023,null,null,null,null,null,null,null,null,null,null,null,null,null,null,null,null,null,null,null,null,null,null,null,null,{"$f":"IF(OR(AND(E149=\"Feb\",OR(F149=2020,OR(F149=2024,OR(F149=2028,OR(F149=2032,OR(F149=2036,F149=2040)))))),AND(E149=\"Feb\",OR(F149=2044,OR(F149=2048,F149=2052)))),29,VLOOKUP(E149,Lookup!$B$2:$C$13,2,FALSE))","v":30},0,null,null,2]
[null,null,null,2,{"$f":"IF(E149=\"\",\"\",VLOOKUP(E149,Lookup!$A$2:$B$13,2,FALSE))","v":"Dec"},2023,null,null,null,null,null,null,null,null,null,null,null,null,null,null,null,null,null,null,null,null,null,null,null,null,{"$f":"IF(OR(AND(E150=\"Feb\",OR(F150=2020,OR(F150=2024,OR(F150=2028,OR(F150=2032,OR(F150=2036,F150=2040)))))),AND(E150=\"Feb\",OR(F150=2044,OR(F150=2048,F150=2052)))),29,VLOOKUP(E150,Lookup!$B$2:$C$13,2,FALSE))","v":31},0,null,null,2]
[null,null,null,3,{"$f":"IF(E150=\"\",\"\",VLOOKUP(E150,Lookup!$A$2:$B$13,2,FALSE))","v":"Jan"},2024,null,null,null,null,null,null,null,null,null,null,null,null,null,null,null,null,null,null,null,null,null,null,null,null,{"$f":"IF(OR(AND(E151=\"Feb\",OR(F151=2020,OR(F151=2024,OR(F151=2028,OR(F151=2032,OR(F151=2036,F151=2040)))))),AND(E151=\"Feb\",OR(F151=2044,OR(F151=2048,F151=2052)))),29,VLOOKUP(E151,Lookup!$B$2:$C$13,2,FALSE))","v":31},0,null,null,{"$f":"+D151","v":3}]
[null,null,null,3,{"$f":"IF(E151=\"\",\"\",VLOOKUP(E151,Lookup!$A$2:$B$13,2,FALSE))","v":"Feb"},2024,null,null,null,null,null,null,null,null,null,null,null,null,null,null,null,null,null,null,null,null,null,null,null,null,{"$f":"IF(OR(AND(E152=\"Feb\",OR(F152=2020,OR(F152=2024,OR(F152=2028,OR(F152=2032,OR(F152=2036,F152=2040)))))),AND(E152=\"Feb\",OR(F152=2044,OR(F152=2048,F152=2052)))),29,VLOOKUP(E152,Lookup!$B$2:$C$13,2,FALSE))","v":29},0,null,null,3]
[null,null,null,3,{"$f":"IF(E152=\"\",\"\",VLOOKUP(E152,Lookup!$A$2:$B$13,2,FALSE))","v":"Mar"},2024,null,null,null,null,null,null,null,null,null,null,null,null,null,null,null,null,null,null,null,null,null,null,null,null,{"$f":"IF(OR(AND(E153=\"Feb\",OR(F153=2020,OR(F153=2024,OR(F153=2028,OR(F153=2032,OR(F153=2036,F153=2040)))))),AND(E153=\"Feb\",OR(F153=2044,OR(F153=2048,F153=2052)))),29,VLOOKUP(E153,Lookup!$B$2:$C$13,2,FALSE))","v":31},0,null,null,3]
[null,null,null,3,{"$f":"IF(E153=\"\",\"\",VLOOKUP(E153,Lookup!$A$2:$B$13,2,FALSE))","v":"Apr"},2024,null,null,null,null,null,null,null,null,null,null,null,null,null,null,null,null,null,null,null,null,null,null,null,null,{"$f":"IF(OR(AND(E154=\"Feb\",OR(F154=2020,OR(F154=2024,OR(F154=2028,OR(F154=2032,OR(F154=2036,F154=2040)))))),AND(E154=\"Feb\",OR(F154=2044,OR(F154=2048,F154=2052)))),29,VLOOKUP(E154,Lookup!$B$2:$C$13,2,FALSE))","v":30},0,null,null,3]
[null,null,null,3,{"$f":"IF(E154=\"\",\"\",VLOOKUP(E154,Lookup!$A$2:$B$13,2,FALSE))","v":"May"},2024,null,null,null,null,null,null,null,null,null,null,null,null,null,null,null,null,null,null,null,null,null,null,null,null,{"$f":"IF(OR(AND(E155=\"Feb\",OR(F155=2020,OR(F155=2024,OR(F155=2028,OR(F155=2032,OR(F155=2036,F155=2040)))))),AND(E155=\"Feb\",OR(F155=2044,OR(F155=2048,F155=2052)))),29,VLOOKUP(E155,Lookup!$B$2:$C$13,2,FALSE))","v":31},0,null,null,3]
[null,null,null,3,{"$f":"IF(E155=\"\",\"\",VLOOKUP(E155,Lookup!$A$2:$B$13,2,FALSE))","v":"Jun"},2024,null,null,null,null,null,null,null,null,null,null,null,null,null,null,null,null,null,null,null,null,null,null,null,null,{"$f":"IF(OR(AND(E156=\"Feb\",OR(F156=2020,OR(F156=2024,OR(F156=2028,OR(F156=2032,OR(F156=2036,F156=2040)))))),AND(E156=\"Feb\",OR(F156=2044,OR(F156=2048,F156=2052)))),29,VLOOKUP(E156,Lookup!$B$2:$C$13,2,FALSE))","v":30},0,null,null,3]
[null,null,null,3,{"$f":"IF(E156=\"\",\"\",VLOOKUP(E156,Lookup!$A$2:$B$13,2,FALSE))","v":"Jul"},2024,null,null,null,null,null,null,null,null,null,null,null,null,null,null,null,null,null,null,null,null,null,null,null,null,{"$f":"IF(OR(AND(E157=\"Feb\",OR(F157=2020,OR(F157=2024,OR(F157=2028,OR(F157=2032,OR(F157=2036,F157=2040)))))),AND(E157=\"Feb\",OR(F157=2044,OR(F157=2048,F157=2052)))),29,VLOOKUP(E157,Lookup!$B$2:$C$13,2,FALSE))","v":31},0,null,null,3]
[null,null,null,3,{"$f":"IF(E157=\"\",\"\",VLOOKUP(E157,Lookup!$A$2:$B$13,2,FALSE))","v":"Aug"},2024,null,null,null,null,null,null,null,null,null,null,null,null,null,null,null,null,null,null,null,null,null,null,null,null,{"$f":"IF(OR(AND(E158=\"Feb\",OR(F158=2020,OR(F158=2024,OR(F158=2028,OR(F158=2032,OR(F158=2036,F158=2040)))))),AND(E158=\"Feb\",OR(F158=2044,OR(F158=2048,F158=2052)))),29,VLOOKUP(E158,Lookup!$B$2:$C$13,2,FALSE))","v":31},0,null,null,3]
[null,null,null,3,{"$f":"IF(E158=\"\",\"\",VLOOKUP(E158,Lookup!$A$2:$B$13,2,FALSE))","v":"Sep"},2024,null,null,null,null,null,null,null,null,null,null,null,null,null,null,null,null,null,null,null,null,null,null,null,null,{"$f":"IF(OR(AND(E159=\"Feb\",OR(F159=2020,OR(F159=2024,OR(F159=2028,OR(F159=2032,OR(F159=2036,F159=2040)))))),AND(E159=\"Feb\",OR(F159=2044,OR(F159=2048,F159=2052)))),29,VLOOKUP(E159,Lookup!$B$2:$C$13,2,FALSE))","v":30},0,null,null,3]
[null,null,null,3,{"$f":"IF(E159=\"\",\"\",VLOOKUP(E159,Lookup!$A$2:$B$13,2,FALSE))","v":"Oct"},2024,null,null,null,null,null,null,null,null,null,null,null,null,null,null,null,null,null,null,null,null,null,null,null,null,{"$f":"IF(OR(AND(E160=\"Feb\",OR(F160=2020,OR(F160=2024,OR(F160=2028,OR(F160=2032,OR(F160=2036,F160=2040)))))),AND(E160=\"Feb\",OR(F160=2044,OR(F160=2048,F160=2052)))),29,VLOOKUP(E160,Lookup!$B$2:$C$13,2,FALSE))","v":31},0,null,null,3]
[null,null,null,3,{"$f":"IF(E160=\"\",\"\",VLOOKUP(E160,Lookup!$A$2:$B$13,2,FALSE))","v":"Nov"},2024,null,null,null,null,null,null,null,null,null,null,null,null,null,null,null,null,null,null,null,null,null,null,null,null,{"$f":"IF(OR(AND(E161=\"Feb\",OR(F161=2020,OR(F161=2024,OR(F161=2028,OR(F161=2032,OR(F161=2036,F161=2040)))))),AND(E161=\"Feb\",OR(F161=2044,OR(F161=2048,F161=2052)))),29,VLOOKUP(E161,Lookup!$B$2:$C$13,2,FALSE))","v":30},0,null,null,3]
[null,null,null,3,{"$f":"IF(E161=\"\",\"\",VLOOKUP(E161,Lookup!$A$2:$B$13,2,FALSE))","v":"Dec"},2024,null,null,null,null,null,null,null,null,null,null,null,null,null,null,null,null,null,null,null,null,null,null,null,null,{"$f":"IF(OR(AND(E162=\"Feb\",OR(F162=2020,OR(F162=2024,OR(F162=2028,OR(F162=2032,OR(F162=2036,F162=2040)))))),AND(E162=\"Feb\",OR(F162=2044,OR(F162=2048,F162=2052)))),29,VLOOKUP(E162,Lookup!$B$2:$C$13,2,FALSE))","v":31},0,null,null,3]
[null,null,null,4,{"$f":"IF(E162=\"\",\"\",VLOOKUP(E162,Lookup!$A$2:$B$13,2,FALSE))","v":"Jan"},2025,null,null,null,null,null,null,null,null,null,null,null,null,null,null,null,null,null,null,null,null,null,null,null,null,{"$f":"IF(OR(AND(E163=\"Feb\",OR(F163=2020,OR(F163=2024,OR(F163=2028,OR(F163=2032,OR(F163=2036,F163=2040)))))),AND(E163=\"Feb\",OR(F163=2044,OR(F163=2048,F163=2052)))),29,VLOOKUP(E163,Lookup!$B$2:$C$13,2,FALSE))","v":31},0,null,null,4]
[null,null,null,4,{"$f":"IF(E163=\"\",\"\",VLOOKUP(E163,Lookup!$A$2:$B$13,2,FALSE))","v":"Feb"},2025,null,null,null,null,null,null,null,null,null,null,null,null,null,null,null,null,null,null,null,null,null,null,null,null,{"$f":"IF(OR(AND(E164=\"Feb\",OR(F164=2020,OR(F164=2024,OR(F164=2028,OR(F164=2032,OR(F164=2036,F164=2040)))))),AND(E164=\"Feb\",OR(F164=2044,OR(F164=2048,F164=2052)))),29,VLOOKUP(E164,Lookup!$B$2:$C$13,2,FALSE))","v":28},0,null,null,4]
[null,null,null,4,{"$f":"IF(E164=\"\",\"\",VLOOKUP(E164,Lookup!$A$2:$B$13,2,FALSE))","v":"Mar"},2025,null,null,null,null,null,null,null,null,null,null,null,null,null,null,null,null,null,null,null,null,null,null,null,null,{"$f":"IF(OR(AND(E165=\"Feb\",OR(F165=2020,OR(F165=2024,OR(F165=2028,OR(F165=2032,OR(F165=2036,F165=2040)))))),AND(E165=\"Feb\",OR(F165=2044,OR(F165=2048,F165=2052)))),29,VLOOKUP(E165,Lookup!$B$2:$C$13,2,FALSE))","v":31},0,null,null,4]
[null,null,null,4,{"$f":"IF(E165=\"\",\"\",VLOOKUP(E165,Lookup!$A$2:$B$13,2,FALSE))","v":"Apr"},2025,null,null,null,null,null,null,null,null,null,null,null,null,null,null,null,null,null,null,null,null,null,null,null,null,{"$f":"IF(OR(AND(E166=\"Feb\",OR(F166=2020,OR(F166=2024,OR(F166=2028,OR(F166=2032,OR(F166=2036,F166=2040)))))),AND(E166=\"Feb\",OR(F166=2044,OR(F166=2048,F166=2052)))),29,VLOOKUP(E166,Lookup!$B$2:$C$13,2,FALSE))","v":30},0,null,null,4]
[null,null,null,4,{"$f":"IF(E166=\"\",\"\",VLOOKUP(E166,Lookup!$A$2:$B$13,2,FALSE))","v":"May"},2025,null,null,null,null,null,null,null,null,null,null,null,null,null,null,null,null,null,null,null,null,null,null,null,null,{"$f":"IF(OR(AND(E167=\"Feb\",OR(F167=2020,OR(F167=2024,OR(F167=2028,OR(F167=2032,OR(F167=2036,F167=2040)))))),AND(E167=\"Feb\",OR(F167=2044,OR(F167=2048,F167=2052)))),29,VLOOKUP(E167,Lookup!$B$2:$C$13,2,FALSE))","v":31},0,null,null,4]
[null,null,null,4,{"$f":"IF(E167=\"\",\"\",VLOOKUP(E167,Lookup!$A$2:$B$13,2,FALSE))","v":"Jun"},2025,null,null,null,null,null,null,null,null,null,null,null,null,null,null,null,null,null,null,null,null,null,null,null,null,{"$f":"IF(OR(AND(E168=\"Feb\",OR(F168=2020,OR(F168=2024,OR(F168=2028,OR(F168=2032,OR(F168=2036,F168=2040)))))),AND(E168=\"Feb\",OR(F168=2044,OR(F168=2048,F168=2052)))),29,VLOOKUP(E168,Lookup!$B$2:$C$13,2,FALSE))","v":30},0,null,null,4]
[null,null,null,4,{"$f":"IF(E168=\"\",\"\",VLOOKUP(E168,Lookup!$A$2:$B$13,2,FALSE))","v":"Jul"},2025,null,null,null,null,null,null,null,null,null,null,null,null,null,null,null,null,null,null,null,null,null,null,null,null,{"$f":"IF(OR(AND(E169=\"Feb\",OR(F169=2020,OR(F169=2024,OR(F169=2028,OR(F169=2032,OR(F169=2036,F169=2040)))))),AND(E169=\"Feb\",OR(F169=2044,OR(F169=2048,F169=2052)))),29,VLOOKUP(E169,Lookup!$B$2:$C$13,2,FALSE))","v":31},0,null,null,4]
[null,null,null,4,{"$f":"IF(E169=\"\",\"\",VLOOKUP(E169,Lookup!$A$2:$B$13,2,FALSE))","v":"Aug"},2025,null,null,null,null,null,null,null,null,null,null,null,null,null,null,null,null,null,null,null,null,null,null,null,null,{"$f":"IF(OR(AND(E170=\"Feb\",OR(F170=2020,OR(F170=2024,OR(F170=2028,OR(F170=2032,OR(F170=2036,F170=2040)))))),AND(E170=\"Feb\",OR(F170=2044,OR(F170=2048,F170=2052)))),29,VLOOKUP(E170,Lookup!$B$2:$C$13,2,FALSE))","v":31},0,null,null,4]
[null,null,null,4,{"$f":"IF(E170=\"\",\"\",VLOOKUP(E170,Lookup!$A$2:$B$13,2,FALSE))","v":"Sep"},2025,null,null,null,null,null,null,null,null,null,null,null,null,null,null,null,null,null,null,null,null,null,null,null,null,{"$f":"IF(OR(AND(E171=\"Feb\",OR(F171=2020,OR(F171=2024,OR(F171=2028,OR(F171=2032,OR(F171=2036,F171=2040)))))),AND(E171=\"Feb\",OR(F171=2044,OR(F171=2048,F171=2052)))),29,VLOOKUP(E171,Lookup!$B$2:$C$13,2,FALSE))","v":30},0,null,null,4]
[null,null,null,4,{"$f":"IF(E171=\"\",\"\",VLOOKUP(E171,Lookup!$A$2:$B$13,2,FALSE))","v":"Oct"},2025,null,null,null,null,null,null,null,null,null,null,null,null,null,null,null,null,null,null,null,null,null,null,null,null,{"$f":"IF(OR(AND(E172=\"Feb\",OR(F172=2020,OR(F172=2024,OR(F172=2028,OR(F172=2032,OR(F172=2036,F172=2040)))))),AND(E172=\"Feb\",OR(F172=2044,OR(F172=2048,F172=2052)))),29,VLOOKUP(E172,Lookup!$B$2:$C$13,2,FALSE))","v":31},0,null,null,4]
[null,null,null,4,{"$f":"IF(E172=\"\",\"\",VLOOKUP(E172,Lookup!$A$2:$B$13,2,FALSE))","v":"Nov"},2025,null,null,null,null,null,null,null,null,null,null,null,null,null,null,null,null,null,null,null,null,null,null,null,null,{"$f":"IF(OR(AND(E173=\"Feb\",OR(F173=2020,OR(F173=2024,OR(F173=2028,OR(F173=2032,OR(F173=2036,F173=2040)))))),AND(E173=\"Feb\",OR(F173=2044,OR(F173=2048,F173=2052)))),29,VLOOKUP(E173,Lookup!$B$2:$C$13,2,FALSE))","v":30},0,null,null,4]
[null,null,null,4,{"$f":"IF(E173=\"\",\"\",VLOOKUP(E173,Lookup!$A$2:$B$13,2,FALSE))","v":"Dec"},2025,null,null,null,null,null,null,null,null,null,null,null,null,null,null,null,null,null,null,null,null,null,null,null,null,{"$f":"IF(OR(AND(E174=\"Feb\",OR(F174=2020,OR(F174=2024,OR(F174=2028,OR(F174=2032,OR(F174=2036,F174=2040)))))),AND(E174=\"Feb\",OR(F174=2044,OR(F174=2048,F174=2052)))),29,VLOOKUP(E174,Lookup!$B$2:$C$13,2,FALSE))","v":31},0,null,null,4]
[null,null,null,5,{"$f":"IF(E174=\"\",\"\",VLOOKUP(E174,Lookup!$A$2:$B$13,2,FALSE))","v":"Jan"},2026,null,null,null,null,null,null,null,null,null,null,null,null,null,null,null,null,null,null,null,null,null,null,null,null,{"$f":"IF(OR(AND(E175=\"Feb\",OR(F175=2020,OR(F175=2024,OR(F175=2028,OR(F175=2032,OR(F175=2036,F175=2040)))))),AND(E175=\"Feb\",OR(F175=2044,OR(F175=2048,F175=2052)))),29,VLOOKUP(E175,Lookup!$B$2:$C$13,2,FALSE))","v":31},0,null,null,{"$f":"+D175","v":5}]
[null,null,null,5,{"$f":"IF(E175=\"\",\"\",VLOOKUP(E175,Lookup!$A$2:$B$13,2,FALSE))","v":"Feb"},2026,null,null,null,null,null,null,null,null,null,null,null,null,null,null,null,null,null,null,null,null,null,null,null,null,{"$f":"IF(OR(AND(E176=\"Feb\",OR(F176=2020,OR(F176=2024,OR(F176=2028,OR(F176=2032,OR(F176=2036,F176=2040)))))),AND(E176=\"Feb\",OR(F176=2044,OR(F176=2048,F176=2052)))),29,VLOOKUP(E176,Lookup!$B$2:$C$13,2,FALSE))","v":28},0,null,null,5]
[null,null,null,5,{"$f":"IF(E176=\"\",\"\",VLOOKUP(E176,Lookup!$A$2:$B$13,2,FALSE))","v":"Mar"},2026,null,null,null,null,null,null,null,null,null,null,null,null,null,null,null,null,null,null,null,null,null,null,null,null,{"$f":"IF(OR(AND(E177=\"Feb\",OR(F177=2020,OR(F177=2024,OR(F177=2028,OR(F177=2032,OR(F177=2036,F177=2040)))))),AND(E177=\"Feb\",OR(F177=2044,OR(F177=2048,F177=2052)))),29,VLOOKUP(E177,Lookup!$B$2:$C$13,2,FALSE))","v":31},0,null,null,5]
[null,null,null,5,{"$f":"IF(E177=\"\",\"\",VLOOKUP(E177,Lookup!$A$2:$B$13,2,FALSE))","v":"Apr"},2026,null,null,null,null,null,null,null,null,null,null,null,null,null,null,null,null,null,null,null,null,null,null,null,null,{"$f":"IF(OR(AND(E178=\"Feb\",OR(F178=2020,OR(F178=2024,OR(F178=2028,OR(F178=2032,OR(F178=2036,F178=2040)))))),AND(E178=\"Feb\",OR(F178=2044,OR(F178=2048,F178=2052)))),29,VLOOKUP(E178,Lookup!$B$2:$C$13,2,FALSE))","v":30},0,null,null,5]
[null,null,null,5,{"$f":"IF(E178=\"\",\"\",VLOOKUP(E178,Lookup!$A$2:$B$13,2,FALSE))","v":"May"},2026,null,null,null,null,null,null,null,null,null,null,null,null,null,null,null,null,null,null,null,null,null,null,null,null,{"$f":"IF(OR(AND(E179=\"Feb\",OR(F179=2020,OR(F179=2024,OR(F179=2028,OR(F179=2032,OR(F179=2036,F179=2040)))))),AND(E179=\"Feb\",OR(F179=2044,OR(F179=2048,F179=2052)))),29,VLOOKUP(E179,Lookup!$B$2:$C$13,2,FALSE))","v":31},0,null,null,5]
[null,null,null,5,{"$f":"IF(E179=\"\",\"\",VLOOKUP(E179,Lookup!$A$2:$B$13,2,FALSE))","v":"Jun"},2026,null,null,null,null,null,null,null,null,null,null,null,null,null,null,null,null,null,null,null,null,null,null,null,null,{"$f":"IF(OR(AND(E180=\"Feb\",OR(F180=2020,OR(F180=2024,OR(F180=2028,OR(F180=2032,OR(F180=2036,F180=2040)))))),AND(E180=\"Feb\",OR(F180=2044,OR(F180=2048,F180=2052)))),29,VLOOKUP(E180,Lookup!$B$2:$C$13,2,FALSE))","v":30},0,null,null,5]
[null,null,null,5,{"$f":"IF(E180=\"\",\"\",VLOOKUP(E180,Lookup!$A$2:$B$13,2,FALSE))","v":"Jul"},2026,null,null,null,null,null,null,null,null,null,null,null,null,null,null,null,null,null,null,null,null,null,null,null,null,{"$f":"IF(OR(AND(E181=\"Feb\",OR(F181=2020,OR(F181=2024,OR(F181=2028,OR(F181=2032,OR(F181=2036,F181=2040)))))),AND(E181=\"Feb\",OR(F181=2044,OR(F181=2048,F181=2052)))),29,VLOOKUP(E181,Lookup!$B$2:$C$13,2,FALSE))","v":31},0,null,null,5]
[null,null,null,5,{"$f":"IF(E181=\"\",\"\",VLOOKUP(E181,Lookup!$A$2:$B$13,2,FALSE))","v":"Aug"},2026,null,null,null,null,null,null,null,null,null,null,null,null,null,null,null,null,null,null,null,null,null,null,null,null,{"$f":"IF(OR(AND(E182=\"Feb\",OR(F182=2020,OR(F182=2024,OR(F182=2028,OR(F182=2032,OR(F182=2036,F182=2040)))))),AND(E182=\"Feb\",OR(F182=2044,OR(F182=2048,F182=2052)))),29,VLOOKUP(E182,Lookup!$B$2:$C$13,2,FALSE))","v":31},0,null,null,5]
[null,null,null,5,{"$f":"IF(E182=\"\",\"\",VLOOKUP(E182,Lookup!$A$2:$B$13,2,FALSE))","v":"Sep"},2026,null,null,null,null,null,null,null,null,null,null,null,null,null,null,null,null,null,null,null,null,null,null,null,null,{"$f":"IF(OR(AND(E183=\"Feb\",OR(F183=2020,OR(F183=2024,OR(F183=2028,OR(F183=2032,OR(F183=2036,F183=2040)))))),AND(E183=\"Feb\",OR(F183=2044,OR(F183=2048,F183=2052)))),29,VLOOKUP(E183,Lookup!$B$2:$C$13,2,FALSE))","v":30},0,null,null,5]
[null,null,null,5,{"$f":"IF(E183=\"\",\"\",VLOOKUP(E183,Lookup!$A$2:$B$13,2,FALSE))","v":"Oct"},2026,null,null,null,null,null,null,null,null,null,null,null,null,null,null,null,null,null,null,null,null,null,null,null,null,{"$f":"IF(OR(AND(E184=\"Feb\",OR(F184=2020,OR(F184=2024,OR(F184=2028,OR(F184=2032,OR(F184=2036,F184=2040)))))),AND(E184=\"Feb\",OR(F184=2044,OR(F184=2048,F184=2052)))),29,VLOOKUP(E184,Lookup!$B$2:$C$13,2,FALSE))","v":31},0,null,null,5]
[null,null,null,5,{"$f":"IF(E184=\"\",\"\",VLOOKUP(E184,Lookup!$A$2:$B$13,2,FALSE))","v":"Nov"},2026,null,null,null,null,null,null,null,null,null,null,null,null,null,null,null,null,null,null,null,null,null,null,null,null,{"$f":"IF(OR(AND(E185=\"Feb\",OR(F185=2020,OR(F185=2024,OR(F185=2028,OR(F185=2032,OR(F185=2036,F185=2040)))))),AND(E185=\"Feb\",OR(F185=2044,OR(F185=2048,F185=2052)))),29,VLOOKUP(E185,Lookup!$B$2:$C$13,2,FALSE))","v":30},0,null,null,5]
[null,null,null,5,{"$f":"IF(E185=\"\",\"\",VLOOKUP(E185,Lookup!$A$2:$B$13,2,FALSE))","v":"Dec"},2026,null,null,null,null,null,null,null,null,null,null,null,null,null,null,null,null,null,null,null,null,null,null,null,null,{"$f":"IF(OR(AND(E186=\"Feb\",OR(F186=2020,OR(F186=2024,OR(F186=2028,OR(F186=2032,OR(F186=2036,F186=2040)))))),AND(E186=\"Feb\",OR(F186=2044,OR(F186=2048,F186=2052)))),29,VLOOKUP(E186,Lookup!$B$2:$C$13,2,FALSE))","v":31},0,null,null,5]
[null,null,null,6,{"$f":"IF(E186=\"\",\"\",VLOOKUP(E186,Lookup!$A$2:$B$13,2,FALSE))","v":"Jan"},2027,null,null,null,null,null,null,null,null,null,null,null,null,null,null,null,null,null,null,null,null,null,null,null,null,{"$f":"IF(OR(AND(E187=\"Feb\",OR(F187=2020,OR(F187=2024,OR(F187=2028,OR(F187=2032,OR(F187=2036,F187=2040)))))),AND(E187=\"Feb\",OR(F187=2044,OR(F187=2048,F187=2052)))),29,VLOOKUP(E187,Lookup!$B$2:$C$13,2,FALSE))","v":31},0,null,null,6]
[null,null,null,6,{"$f":"IF(E187=\"\",\"\",VLOOKUP(E187,Lookup!$A$2:$B$13,2,FALSE))","v":"Feb"},2027,null,null,null,null,null,null,null,null,null,null,null,null,null,null,null,null,null,null,null,null,null,null,null,null,{"$f":"IF(OR(AND(E188=\"Feb\",OR(F188=2020,OR(F188=2024,OR(F188=2028,OR(F188=2032,OR(F188=2036,F188=2040)))))),AND(E188=\"Feb\",OR(F188=2044,OR(F188=2048,F188=2052)))),29,VLOOKUP(E188,Lookup!$B$2:$C$13,2,FALSE))","v":28},0,null,null,6]
[null,null,null,6,{"$f":"IF(E188=\"\",\"\",VLOOKUP(E188,Lookup!$A$2:$B$13,2,FALSE))","v":"Mar"},2027,null,null,null,null,null,null,null,null,null,null,null,null,null,null,null,null,null,null,null,null,null,null,null,null,{"$f":"IF(OR(AND(E189=\"Feb\",OR(F189=2020,OR(F189=2024,OR(F189=2028,OR(F189=2032,OR(F189=2036,F189=2040)))))),AND(E189=\"Feb\",OR(F189=2044,OR(F189=2048,F189=2052)))),29,VLOOKUP(E189,Lookup!$B$2:$C$13,2,FALSE))","v":31},0,null,null,6]
[null,null,null,6,{"$f":"IF(E189=\"\",\"\",VLOOKUP(E189,Lookup!$A$2:$B$13,2,FALSE))","v":"Apr"},2027,null,null,null,null,null,null,null,null,null,null,null,null,null,null,null,null,null,null,null,null,null,null,null,null,{"$f":"IF(OR(AND(E190=\"Feb\",OR(F190=2020,OR(F190=2024,OR(F190=2028,OR(F190=2032,OR(F190=2036,F190=2040)))))),AND(E190=\"Feb\",OR(F190=2044,OR(F190=2048,F190=2052)))),29,VLOOKUP(E190,Lookup!$B$2:$C$13,2,FALSE))","v":30},0,null,null,6]
[null,null,null,6,{"$f":"IF(E190=\"\",\"\",VLOOKUP(E190,Lookup!$A$2:$B$13,2,FALSE))","v":"May"},2027,null,null,null,null,null,null,null,null,null,null,null,null,null,null,null,null,null,null,null,null,null,null,null,null,{"$f":"IF(OR(AND(E191=\"Feb\",OR(F191=2020,OR(F191=2024,OR(F191=2028,OR(F191=2032,OR(F191=2036,F191=2040)))))),AND(E191=\"Feb\",OR(F191=2044,OR(F191=2048,F191=2052)))),29,VLOOKUP(E191,Lookup!$B$2:$C$13,2,FALSE))","v":31},{"$f":"SUM(G191:AD191)*AE191","v":0},null,null,6]
[null,null,null,6,{"$f":"IF(E191=\"\",\"\",VLOOKUP(E191,Lookup!$A$2:$B$13,2,FALSE))","v":"Jun"},2027,null,null,null,null,null,null,null,null,null,null,null,null,null,null,null,null,null,null,null,null,null,null,null,null,{"$f":"IF(OR(AND(E192=\"Feb\",OR(F192=2020,OR(F192=2024,OR(F192=2028,OR(F192=2032,OR(F192=2036,F192=2040)))))),AND(E192=\"Feb\",OR(F192=2044,OR(F192=2048,F192=2052)))),29,VLOOKUP(E192,Lookup!$B$2:$C$13,2,FALSE))","v":30},0,null,null,{"$f":"+D192","v":6}]
[null,null,null,6,{"$f":"IF(E192=\"\",\"\",VLOOKUP(E192,Lookup!$A$2:$B$13,2,FALSE))","v":"Jul"},2027,null,null,null,null,null,null,null,null,null,null,null,null,null,null,null,null,null,null,null,null,null,null,null,null,{"$f":"IF(OR(AND(E193=\"Feb\",OR(F193=2020,OR(F193=2024,OR(F193=2028,OR(F193=2032,OR(F193=2036,F193=2040)))))),AND(E193=\"Feb\",OR(F193=2044,OR(F193=2048,F193=2052)))),29,VLOOKUP(E193,Lookup!$B$2:$C$13,2,FALSE))","v":31},0,null,null,6]
[null,null,null,6,{"$f":"IF(E193=\"\",\"\",VLOOKUP(E193,Lookup!$A$2:$B$13,2,FALSE))","v":"Aug"},2027,null,null,null,null,null,null,null,null,null,null,null,null,null,null,null,null,null,null,null,null,null,null,null,null,{"$f":"IF(OR(AND(E194=\"Feb\",OR(F194=2020,OR(F194=2024,OR(F194=2028,OR(F194=2032,OR(F194=2036,F194=2040)))))),AND(E194=\"Feb\",OR(F194=2044,OR(F194=2048,F194=2052)))),29,VLOOKUP(E194,Lookup!$B$2:$C$13,2,FALSE))","v":31},0,null,null,6]
[null,null,null,6,{"$f":"IF(E194=\"\",\"\",VLOOKUP(E194,Lookup!$A$2:$B$13,2,FALSE))","v":"Sep"},2027,null,null,null,null,null,null,null,null,null,null,null,null,null,null,null,null,null,null,null,null,null,null,null,null,{"$f":"IF(OR(AND(E195=\"Feb\",OR(F195=2020,OR(F195=2024,OR(F195=2028,OR(F195=2032,OR(F195=2036,F195=2040)))))),AND(E195=\"Feb\",OR(F195=2044,OR(F195=2048,F195=2052)))),29,VLOOKUP(E195,Lookup!$B$2:$C$13,2,FALSE))","v":30},0,null,null,6]
[null,null,null,6,{"$f":"IF(E195=\"\",\"\",VLOOKUP(E195,Lookup!$A$2:$B$13,2,FALSE))","v":"Oct"},2027,null,null,null,null,null,null,null,null,null,null,null,null,null,null,null,null,null,null,null,null,null,null,null,null,{"$f":"IF(OR(AND(E196=\"Feb\",OR(F196=2020,OR(F196=2024,OR(F196=2028,OR(F196=2032,OR(F196=2036,F196=2040)))))),AND(E196=\"Feb\",OR(F196=2044,OR(F196=2048,F196=2052)))),29,VLOOKUP(E196,Lookup!$B$2:$C$13,2,FALSE))","v":31},0,null,null,6]
[null,null,null,6,{"$f":"IF(E196=\"\",\"\",VLOOKUP(E196,Lookup!$A$2:$B$13,2,FALSE))","v":"Nov"},2027,null,null,null,null,null,null,null,null,null,null,null,null,null,null,null,null,null,null,null,null,null,null,null,null,{"$f":"IF(OR(AND(E197=\"Feb\",OR(F197=2020,OR(F197=2024,OR(F197=2028,OR(F197=2032,OR(F197=2036,F197=2040)))))),AND(E197=\"Feb\",OR(F197=2044,OR(F197=2048,F197=2052)))),29,VLOOKUP(E197,Lookup!$B$2:$C$13,2,FALSE))","v":30},0,null,null,6]
[null,null,null,6,{"$f":"IF(E197=\"\",\"\",VLOOKUP(E197,Lookup!$A$2:$B$13,2,FALSE))","v":"Dec"},2027,null,null,null,null,null,null,null,null,null,null,null,null,null,null,null,null,null,null,null,null,null,null,null,null,{"$f":"IF(OR(AND(E198=\"Feb\",OR(F198=2020,OR(F198=2024,OR(F198=2028,OR(F198=2032,OR(F198=2036,F198=2040)))))),AND(E198=\"Feb\",OR(F198=2044,OR(F198=2048,F198=2052)))),29,VLOOKUP(E198,Lookup!$B$2:$C$13,2,FALSE))","v":31},0,null,null,6]
[null,null,null,7,{"$f":"IF(E198=\"\",\"\",VLOOKUP(E198,Lookup!$A$2:$B$13,2,FALSE))","v":"Jan"},2028,null,null,null,null,null,null,null,null,null,null,null,null,null,null,null,null,null,null,null,null,null,null,null,null,{"$f":"IF(OR(AND(E199=\"Feb\",OR(F199=2020,OR(F199=2024,OR(F199=2028,OR(F199=2032,OR(F199=2036,F199=2040)))))),AND(E199=\"Feb\",OR(F199=2044,OR(F199=2048,F199=2052)))),29,VLOOKUP(E199,Lookup!$B$2:$C$13,2,FALSE))","v":31},0,null,null,{"$f":"+D199","v":7}]
[null,null,null,7,{"$f":"IF(E199=\"\",\"\",VLOOKUP(E199,Lookup!$A$2:$B$13,2,FALSE))","v":"Feb"},2028,null,null,null,null,null,null,null,null,null,null,null,null,null,null,null,null,null,null,null,null,null,null,null,null,{"$f":"IF(OR(AND(E200=\"Feb\",OR(F200=2020,OR(F200=2024,OR(F200=2028,OR(F200=2032,OR(F200=2036,F200=2040)))))),AND(E200=\"Feb\",OR(F200=2044,OR(F200=2048,F200=2052)))),29,VLOOKUP(E200,Lookup!$B$2:$C$13,2,FALSE))","v":29},0,null,null,{"$f":"+D200","v":7}]
[null,null,null,7,{"$f":"IF(E200=\"\",\"\",VLOOKUP(E200,Lookup!$A$2:$B$13,2,FALSE))","v":"Mar"},2028,null,null,null,null,null,null,null,null,null,null,null,null,null,null,null,null,null,null,null,null,null,null,null,null,{"$f":"IF(OR(AND(E201=\"Feb\",OR(F201=2020,OR(F201=2024,OR(F201=2028,OR(F201=2032,OR(F201=2036,F201=2040)))))),AND(E201=\"Feb\",OR(F201=2044,OR(F201=2048,F201=2052)))),29,VLOOKUP(E201,Lookup!$B$2:$C$13,2,FALSE))","v":31},0,null,null,7]
[null,null,null,7,{"$f":"IF(E201=\"\",\"\",VLOOKUP(E201,Lookup!$A$2:$B$13,2,FALSE))","v":"Apr"},2028,null,null,null,null,null,null,null,null,null,null,null,null,null,null,null,null,null,null,null,null,null,null,null,null,{"$f":"IF(OR(AND(E202=\"Feb\",OR(F202=2020,OR(F202=2024,OR(F202=2028,OR(F202=2032,OR(F202=2036,F202=2040)))))),AND(E202=\"Feb\",OR(F202=2044,OR(F202=2048,F202=2052)))),29,VLOOKUP(E202,Lookup!$B$2:$C$13,2,FALSE))","v":30},0,null,null,7]
[null,null,null,7,{"$f":"IF(E202=\"\",\"\",VLOOKUP(E202,Lookup!$A$2:$B$13,2,FALSE))","v":"May"},2028,null,null,null,null,null,null,null,null,null,null,null,null,null,null,null,null,null,null,null,null,null,null,null,null,{"$f":"IF(OR(AND(E203=\"Feb\",OR(F203=2020,OR(F203=2024,OR(F203=2028,OR(F203=2032,OR(F203=2036,F203=2040)))))),AND(E203=\"Feb\",OR(F203=2044,OR(F203=2048,F203=2052)))),29,VLOOKUP(E203,Lookup!$B$2:$C$13,2,FALSE))","v":31},0,null,null,7]
[null,null,null,{"$f":"+D192+1","v":7},{"$f":"IF(E203=\"\",\"\",VLOOKUP(E203,Lookup!$A$2:$B$13,2,FALSE))","v":"Jun"},{"$f":"IF(E203=0,\"\",IF(E203=\"Dec\",F203+1,F203))","v":2028},null,null,null,null,null,null,null,null,null,null,null,null,null,null,null,null,null,null,null,null,null,null,null,null,{"$f":"IF(OR(AND(E204=\"Feb\",OR(F204=2020,OR(F204=2024,OR(F204=2028,OR(F204=2032,OR(F204=2036,F204=2040)))))),AND(E204=\"Feb\",OR(F204=2044,OR(F204=2048,F204=2052)))),29,VLOOKUP(E204,Lookup!$B$2:$C$13,2,FALSE))","v":30},0,null,null,7]
[null,null,null,7,{"$f":"IF(E204=\"\",\"\",VLOOKUP(E204,Lookup!$A$2:$B$13,2,FALSE))","v":"Jul"},2028,null,null,null,null,null,null,null,null,null,null,null,null,null,null,null,null,null,null,null,null,null,null,null,null,{"$f":"IF(OR(AND(E205=\"Feb\",OR(F205=2020,OR(F205=2024,OR(F205=2028,OR(F205=2032,OR(F205=2036,F205=2040)))))),AND(E205=\"Feb\",OR(F205=2044,OR(F205=2048,F205=2052)))),29,VLOOKUP(E205,Lookup!$B$2:$C$13,2,FALSE))","v":31},0,null,null,7]
[null,null,null,7,{"$f":"IF(E205=\"\",\"\",VLOOKUP(E205,Lookup!$A$2:$B$13,2,FALSE))","v":"Aug"},2028,null,null,null,null,null,null,null,null,null,null,null,null,null,null,null,null,null,null,null,null,null,null,null,null,{"$f":"IF(OR(AND(E206=\"Feb\",OR(F206=2020,OR(F206=2024,OR(F206=2028,OR(F206=2032,OR(F206=2036,F206=2040)))))),AND(E206=\"Feb\",OR(F206=2044,OR(F206=2048,F206=2052)))),29,VLOOKUP(E206,Lookup!$B$2:$C$13,2,FALSE))","v":31},0,null,null,7]
[null,null,null,7,{"$f":"IF(E206=\"\",\"\",VLOOKUP(E206,Lookup!$A$2:$B$13,2,FALSE))","v":"Sep"},2028,null,null,null,null,null,null,null,null,null,null,null,null,null,null,null,null,null,null,null,null,null,null,null,null,{"$f":"IF(OR(AND(E207=\"Feb\",OR(F207=2020,OR(F207=2024,OR(F207=2028,OR(F207=2032,OR(F207=2036,F207=2040)))))),AND(E207=\"Feb\",OR(F207=2044,OR(F207=2048,F207=2052)))),29,VLOOKUP(E207,Lookup!$B$2:$C$13,2,FALSE))","v":30},0,null,null,7]
[null,null,null,7,{"$f":"IF(E207=\"\",\"\",VLOOKUP(E207,Lookup!$A$2:$B$13,2,FALSE))","v":"Oct"},2028,null,null,null,null,null,null,null,null,null,null,null,null,null,null,null,null,null,null,null,null,null,null,null,null,{"$f":"IF(OR(AND(E208=\"Feb\",OR(F208=2020,OR(F208=2024,OR(F208=2028,OR(F208=2032,OR(F208=2036,F208=2040)))))),AND(E208=\"Feb\",OR(F208=2044,OR(F208=2048,F208=2052)))),29,VLOOKUP(E208,Lookup!$B$2:$C$13,2,FALSE))","v":31},0,null,null,7]
[null,null,null,7,{"$f":"IF(E208=\"\",\"\",VLOOKUP(E208,Lookup!$A$2:$B$13,2,FALSE))","v":"Nov"},2028,null,null,null,null,null,null,null,null,null,null,null,null,null,null,null,null,null,null,null,null,null,null,null,null,{"$f":"IF(OR(AND(E209=\"Feb\",OR(F209=2020,OR(F209=2024,OR(F209=2028,OR(F209=2032,OR(F209=2036,F209=2040)))))),AND(E209=\"Feb\",OR(F209=2044,OR(F209=2048,F209=2052)))),29,VLOOKUP(E209,Lookup!$B$2:$C$13,2,FALSE))","v":30},0,null,null,7]
[null,null,null,7,{"$f":"IF(E209=\"\",\"\",VLOOKUP(E209,Lookup!$A$2:$B$13,2,FALSE))","v":"Dec"},2028,null,null,null,null,null,null,null,null,null,null,null,null,null,null,null,null,null,null,null,null,null,null,null,null,{"$f":"IF(OR(AND(E210=\"Feb\",OR(F210=2020,OR(F210=2024,OR(F210=2028,OR(F210=2032,OR(F210=2036,F210=2040)))))),AND(E210=\"Feb\",OR(F210=2044,OR(F210=2048,F210=2052)))),29,VLOOKUP(E210,Lookup!$B$2:$C$13,2,FALSE))","v":31},0,null,null,7]
[null,null,null,8,{"$f":"IF(E210=\"\",\"\",VLOOKUP(E210,Lookup!$A$2:$B$13,2,FALSE))","v":"Jan"},2029,null,null,null,null,null,null,null,null,null,null,null,null,null,null,null,null,null,null,null,null,null,null,null,null,{"$f":"IF(OR(AND(E211=\"Feb\",OR(F211=2020,OR(F211=2024,OR(F211=2028,OR(F211=2032,OR(F211=2036,F211=2040)))))),AND(E211=\"Feb\",OR(F211=2044,OR(F211=2048,F211=2052)))),29,VLOOKUP(E211,Lookup!$B$2:$C$13,2,FALSE))","v":31},0,null,null,8]
[null,null,null,8,{"$f":"IF(E211=\"\",\"\",VLOOKUP(E211,Lookup!$A$2:$B$13,2,FALSE))","v":"Feb"},2029,null,null,null,null,null,null,null,null,null,null,null,null,null,null,null,null,null,null,null,null,null,null,null,null,{"$f":"IF(OR(AND(E212=\"Feb\",OR(F212=2020,OR(F212=2024,OR(F212=2028,OR(F212=2032,OR(F212=2036,F212=2040)))))),AND(E212=\"Feb\",OR(F212=2044,OR(F212=2048,F212=2052)))),29,VLOOKUP(E212,Lookup!$B$2:$C$13,2,FALSE))","v":28},0,null,null,8]
[null,null,null,8,{"$f":"IF(E212=\"\",\"\",VLOOKUP(E212,Lookup!$A$2:$B$13,2,FALSE))","v":"Mar"},2029,null,null,null,null,null,null,null,null,null,null,null,null,null,null,null,null,null,null,null,null,null,null,null,null,{"$f":"IF(OR(AND(E213=\"Feb\",OR(F213=2020,OR(F213=2024,OR(F213=2028,OR(F213=2032,OR(F213=2036,F213=2040)))))),AND(E213=\"Feb\",OR(F213=2044,OR(F213=2048,F213=2052)))),29,VLOOKUP(E213,Lookup!$B$2:$C$13,2,FALSE))","v":31},0,null,null,8]
[null,null,null,8,{"$f":"IF(E213=\"\",\"\",VLOOKUP(E213,Lookup!$A$2:$B$13,2,FALSE))","v":"Apr"},2029,null,null,null,null,null,null,null,null,null,null,null,null,null,null,null,null,null,null,null,null,null,null,null,null,{"$f":"IF(OR(AND(E214=\"Feb\",OR(F214=2020,OR(F214=2024,OR(F214=2028,OR(F214=2032,OR(F214=2036,F214=2040)))))),AND(E214=\"Feb\",OR(F214=2044,OR(F214=2048,F214=2052)))),29,VLOOKUP(E214,Lookup!$B$2:$C$13,2,FALSE))","v":30},0,null,null,8]
[null,null,null,8,{"$f":"IF(E214=\"\",\"\",VLOOKUP(E214,Lookup!$A$2:$B$13,2,FALSE))","v":"May"},2029,null,null,null,null,null,null,null,null,null,null,null,null,null,null,null,null,null,null,null,null,null,null,null,null,{"$f":"IF(OR(AND(E215=\"Feb\",OR(F215=2020,OR(F215=2024,OR(F215=2028,OR(F215=2032,OR(F215=2036,F215=2040)))))),AND(E215=\"Feb\",OR(F215=2044,OR(F215=2048,F215=2052)))),29,VLOOKUP(E215,Lookup!$B$2:$C$13,2,FALSE))","v":31},0,null,null,8]
[null,null,null,8,{"$f":"IF(E215=\"\",\"\",VLOOKUP(E215,Lookup!$A$2:$B$13,2,FALSE))","v":"Jun"},2029,null,null,null,null,null,null,null,null,null,null,null,null,null,null,null,null,null,null,null,null,null,null,null,null,{"$f":"IF(OR(AND(E216=\"Feb\",OR(F216=2020,OR(F216=2024,OR(F216=2028,OR(F216=2032,OR(F216=2036,F216=2040)))))),AND(E216=\"Feb\",OR(F216=2044,OR(F216=2048,F216=2052)))),29,VLOOKUP(E216,Lookup!$B$2:$C$13,2,FALSE))","v":30},0,null,null,8]
[null,null,null,8,{"$f":"IF(E216=\"\",\"\",VLOOKUP(E216,Lookup!$A$2:$B$13,2,FALSE))","v":"Jul"},2029,null,null,null,null,null,null,null,null,null,null,null,null,null,null,null,null,null,null,null,null,null,null,null,null,{"$f":"IF(OR(AND(E217=\"Feb\",OR(F217=2020,OR(F217=2024,OR(F217=2028,OR(F217=2032,OR(F217=2036,F217=2040)))))),AND(E217=\"Feb\",OR(F217=2044,OR(F217=2048,F217=2052)))),29,VLOOKUP(E217,Lookup!$B$2:$C$13,2,FALSE))","v":31},0,null,null,8]
[null,null,null,8,{"$f":"IF(E217=\"\",\"\",VLOOKUP(E217,Lookup!$A$2:$B$13,2,FALSE))","v":"Aug"},2029,null,null,null,null,null,null,null,null,null,null,null,null,null,null,null,null,null,null,null,null,null,null,null,null,{"$f":"IF(OR(AND(E218=\"Feb\",OR(F218=2020,OR(F218=2024,OR(F218=2028,OR(F218=2032,OR(F218=2036,F218=2040)))))),AND(E218=\"Feb\",OR(F218=2044,OR(F218=2048,F218=2052)))),29,VLOOKUP(E218,Lookup!$B$2:$C$13,2,FALSE))","v":31},0,null,null,8]
[null,null,null,8,{"$f":"IF(E218=\"\",\"\",VLOOKUP(E218,Lookup!$A$2:$B$13,2,FALSE))","v":"Sep"},2029,null,null,null,null,null,null,null,null,null,null,null,null,null,null,null,null,null,null,null,null,null,null,null,null,{"$f":"IF(OR(AND(E219=\"Feb\",OR(F219=2020,OR(F219=2024,OR(F219=2028,OR(F219=2032,OR(F219=2036,F219=2040)))))),AND(E219=\"Feb\",OR(F219=2044,OR(F219=2048,F219=2052)))),29,VLOOKUP(E219,Lookup!$B$2:$C$13,2,FALSE))","v":30},0,null,null,8]
[null,null,null,8,{"$f":"IF(E219=\"\",\"\",VLOOKUP(E219,Lookup!$A$2:$B$13,2,FALSE))","v":"Oct"},2029,null,null,null,null,null,null,null,null,null,null,null,null,null,null,null,null,null,null,null,null,null,null,null,null,{"$f":"IF(OR(AND(E220=\"Feb\",OR(F220=2020,OR(F220=2024,OR(F220=2028,OR(F220=2032,OR(F220=2036,F220=2040)))))),AND(E220=\"Feb\",OR(F220=2044,OR(F220=2048,F220=2052)))),29,VLOOKUP(E220,Lookup!$B$2:$C$13,2,FALSE))","v":31},0,null,null,8]
[null,null,null,8,{"$f":"IF(E220=\"\",\"\",VLOOKUP(E220,Lookup!$A$2:$B$13,2,FALSE))","v":"Nov"},2029,null,null,null,null,null,null,null,null,null,null,null,null,null,null,null,null,null,null,null,null,null,null,null,null,{"$f":"IF(OR(AND(E221=\"Feb\",OR(F221=2020,OR(F221=2024,OR(F221=2028,OR(F221=2032,OR(F221=2036,F221=2040)))))),AND(E221=\"Feb\",OR(F221=2044,OR(F221=2048,F221=2052)))),29,VLOOKUP(E221,Lookup!$B$2:$C$13,2,FALSE))","v":30},0,null,null,8]
[null,null,null,8,{"$f":"IF(E221=\"\",\"\",VLOOKUP(E221,Lookup!$A$2:$B$13,2,FALSE))","v":"Dec"},2029,null,null,null,null,null,null,null,null,null,null,null,null,null,null,null,null,null,null,null,null,null,null,null,null,{"$f":"IF(OR(AND(E222=\"Feb\",OR(F222=2020,OR(F222=2024,OR(F222=2028,OR(F222=2032,OR(F222=2036,F222=2040)))))),AND(E222=\"Feb\",OR(F222=2044,OR(F222=2048,F222=2052)))),29,VLOOKUP(E222,Lookup!$B$2:$C$13,2,FALSE))","v":31},0,null,null,8]
[null,null,null,9,{"$f":"IF(E222=\"\",\"\",VLOOKUP(E222,Lookup!$A$2:$B$13,2,FALSE))","v":"Jan"},2030,null,null,null,null,null,null,null,null,null,null,null,null,null,null,null,null,null,null,null,null,null,null,null,null,{"$f":"IF(OR(AND(E223=\"Feb\",OR(F223=2020,OR(F223=2024,OR(F223=2028,OR(F223=2032,OR(F223=2036,F223=2040)))))),AND(E223=\"Feb\",OR(F223=2044,OR(F223=2048,F223=2052)))),29,VLOOKUP(E223,Lookup!$B$2:$C$13,2,FALSE))","v":31},0,null,null,{"$f":"+D223","v":9}]
[null,null,null,9,{"$f":"IF(E223=\"\",\"\",VLOOKUP(E223,Lookup!$A$2:$B$13,2,FALSE))","v":"Feb"},2030,null,null,null,null,null,null,null,null,null,null,null,null,null,null,null,null,null,null,null,null,null,null,null,null,{"$f":"IF(OR(AND(E224=\"Feb\",OR(F224=2020,OR(F224=2024,OR(F224=2028,OR(F224=2032,OR(F224=2036,F224=2040)))))),AND(E224=\"Feb\",OR(F224=2044,OR(F224=2048,F224=2052)))),29,VLOOKUP(E224,Lookup!$B$2:$C$13,2,FALSE))","v":28},0,null,null,{"$f":"+D224","v":9}]
[null,null,null,9,{"$f":"IF(E224=\"\",\"\",VLOOKUP(E224,Lookup!$A$2:$B$13,2,FALSE))","v":"Mar"},2030,null,null,null,null,null,null,null,null,null,null,null,null,null,null,null,null,null,null,null,null,null,null,null,null,{"$f":"IF(OR(AND(E225=\"Feb\",OR(F225=2020,OR(F225=2024,OR(F225=2028,OR(F225=2032,OR(F225=2036,F225=2040)))))),AND(E225=\"Feb\",OR(F225=2044,OR(F225=2048,F225=2052)))),29,VLOOKUP(E225,Lookup!$B$2:$C$13,2,FALSE))","v":31},0,null,null,9]
[null,null,null,9,{"$f":"IF(E225=\"\",\"\",VLOOKUP(E225,Lookup!$A$2:$B$13,2,FALSE))","v":"Apr"},2030,null,null,null,null,null,null,null,null,null,null,null,null,null,null,null,null,null,null,null,null,null,null,null,null,{"$f":"IF(OR(AND(E226=\"Feb\",OR(F226=2020,OR(F226=2024,OR(F226=2028,OR(F226=2032,OR(F226=2036,F226=2040)))))),AND(E226=\"Feb\",OR(F226=2044,OR(F226=2048,F226=2052)))),29,VLOOKUP(E226,Lookup!$B$2:$C$13,2,FALSE))","v":30},0,null,null,9]
[null,null,null,9,{"$f":"IF(E226=\"\",\"\",VLOOKUP(E226,Lookup!$A$2:$B$13,2,FALSE))","v":"May"},2030,null,null,null,null,null,null,null,null,null,null,null,null,null,null,null,null,null,null,null,null,null,null,null,null,{"$f":"IF(OR(AND(E227=\"Feb\",OR(F227=2020,OR(F227=2024,OR(F227=2028,OR(F227=2032,OR(F227=2036,F227=2040)))))),AND(E227=\"Feb\",OR(F227=2044,OR(F227=2048,F227=2052)))),29,VLOOKUP(E227,Lookup!$B$2:$C$13,2,FALSE))","v":31},0,null,null,9]
[null,null,null,9,{"$f":"IF(E227=\"\",\"\",VLOOKUP(E227,Lookup!$A$2:$B$13,2,FALSE))","v":"Jun"},2030,null,null,null,null,null,null,null,null,null,null,null,null,null,null,null,null,null,null,null,null,null,null,null,null,{"$f":"IF(OR(AND(E228=\"Feb\",OR(F228=2020,OR(F228=2024,OR(F228=2028,OR(F228=2032,OR(F228=2036,F228=2040)))))),AND(E228=\"Feb\",OR(F228=2044,OR(F228=2048,F228=2052)))),29,VLOOKUP(E228,Lookup!$B$2:$C$13,2,FALSE))","v":30},0,null,null,9]
[null,null,null,9,{"$f":"IF(E228=\"\",\"\",VLOOKUP(E228,Lookup!$A$2:$B$13,2,FALSE))","v":"Jul"},2030,null,null,null,null,null,null,null,null,null,null,null,null,null,null,null,null,null,null,null,null,null,null,null,null,{"$f":"IF(OR(AND(E229=\"Feb\",OR(F229=2020,OR(F229=2024,OR(F229=2028,OR(F229=2032,OR(F229=2036,F229=2040)))))),AND(E229=\"Feb\",OR(F229=2044,OR(F229=2048,F229=2052)))),29,VLOOKUP(E229,Lookup!$B$2:$C$13,2,FALSE))","v":31},0,null,null,9]
[null,null,null,9,{"$f":"IF(E229=\"\",\"\",VLOOKUP(E229,Lookup!$A$2:$B$13,2,FALSE))","v":"Aug"},2030,null,null,null,null,null,null,null,null,null,null,null,null,null,null,null,null,null,null,null,null,null,null,null,null,{"$f":"IF(OR(AND(E230=\"Feb\",OR(F230=2020,OR(F230=2024,OR(F230=2028,OR(F230=2032,OR(F230=2036,F230=2040)))))),AND(E230=\"Feb\",OR(F230=2044,OR(F230=2048,F230=2052)))),29,VLOOKUP(E230,Lookup!$B$2:$C$13,2,FALSE))","v":31},0,null,null,9]
[null,null,null,9,{"$f":"IF(E230=\"\",\"\",VLOOKUP(E230,Lookup!$A$2:$B$13,2,FALSE))","v":"Sep"},2030,null,null,null,null,null,null,null,null,null,null,null,null,null,null,null,null,null,null,null,null,null,null,null,null,{"$f":"IF(OR(AND(E231=\"Feb\",OR(F231=2020,OR(F231=2024,OR(F231=2028,OR(F231=2032,OR(F231=2036,F231=2040)))))),AND(E231=\"Feb\",OR(F231=2044,OR(F231=2048,F231=2052)))),29,VLOOKUP(E231,Lookup!$B$2:$C$13,2,FALSE))","v":30},0,null,null,9]
[null,null,null,9,{"$f":"IF(E231=\"\",\"\",VLOOKUP(E231,Lookup!$A$2:$B$13,2,FALSE))","v":"Oct"},2030,null,null,null,null,null,null,null,null,null,null,null,null,null,null,null,null,null,null,null,null,null,null,null,null,{"$f":"IF(OR(AND(E232=\"Feb\",OR(F232=2020,OR(F232=2024,OR(F232=2028,OR(F232=2032,OR(F232=2036,F232=2040)))))),AND(E232=\"Feb\",OR(F232=2044,OR(F232=2048,F232=2052)))),29,VLOOKUP(E232,Lookup!$B$2:$C$13,2,FALSE))","v":31},0,null,null,9]
[null,null,null,9,{"$f":"IF(E232=\"\",\"\",VLOOKUP(E232,Lookup!$A$2:$B$13,2,FALSE))","v":"Nov"},2030,null,null,null,null,null,null,null,null,null,null,null,null,null,null,null,null,null,null,null,null,null,null,null,null,{"$f":"IF(OR(AND(E233=\"Feb\",OR(F233=2020,OR(F233=2024,OR(F233=2028,OR(F233=2032,OR(F233=2036,F233=2040)))))),AND(E233=\"Feb\",OR(F233=2044,OR(F233=2048,F233=2052)))),29,VLOOKUP(E233,Lookup!$B$2:$C$13,2,FALSE))","v":30},0,null,null,9]
[null,null,null,9,{"$f":"IF(E233=\"\",\"\",VLOOKUP(E233,Lookup!$A$2:$B$13,2,FALSE))","v":"Dec"},2030,null,null,null,null,null,null,null,null,null,null,null,null,null,null,null,null,null,null,null,null,null,null,null,null,{"$f":"IF(OR(AND(E234=\"Feb\",OR(F234=2020,OR(F234=2024,OR(F234=2028,OR(F234=2032,OR(F234=2036,F234=2040)))))),AND(E234=\"Feb\",OR(F234=2044,OR(F234=2048,F234=2052)))),29,VLOOKUP(E234,Lookup!$B$2:$C$13,2,FALSE))","v":31},0,null,null,9]
[null,null,null,10,{"$f":"IF(E234=\"\",\"\",VLOOKUP(E234,Lookup!$A$2:$B$13,2,FALSE))","v":"Jan"},2031,null,null,null,null,null,null,null,null,null,null,null,null,null,null,null,null,null,null,null,null,null,null,null,null,{"$f":"IF(OR(AND(E235=\"Feb\",OR(F235=2020,OR(F235=2024,OR(F235=2028,OR(F235=2032,OR(F235=2036,F235=2040)))))),AND(E235=\"Feb\",OR(F235=2044,OR(F235=2048,F235=2052)))),29,VLOOKUP(E235,Lookup!$B$2:$C$13,2,FALSE))","v":31},0,null,null,10]
[null,null,null,10,{"$f":"IF(E235=\"\",\"\",VLOOKUP(E235,Lookup!$A$2:$B$13,2,FALSE))","v":"Feb"},2031,null,null,null,null,null,null,null,null,null,null,null,null,null,null,null,null,null,null,null,null,null,null,null,null,{"$f":"IF(OR(AND(E236=\"Feb\",OR(F236=2020,OR(F236=2024,OR(F236=2028,OR(F236=2032,OR(F236=2036,F236=2040)))))),AND(E236=\"Feb\",OR(F236=2044,OR(F236=2048,F236=2052)))),29,VLOOKUP(E236,Lookup!$B$2:$C$13,2,FALSE))","v":28},0,null,null,10]
[null,null,null,10,{"$f":"IF(E236=\"\",\"\",VLOOKUP(E236,Lookup!$A$2:$B$13,2,FALSE))","v":"Mar"},2031,null,null,null,null,null,null,null,null,null,null,null,null,null,null,null,null,null,null,null,null,null,null,null,null,{"$f":"IF(OR(AND(E237=\"Feb\",OR(F237=2020,OR(F237=2024,OR(F237=2028,OR(F237=2032,OR(F237=2036,F237=2040)))))),AND(E237=\"Feb\",OR(F237=2044,OR(F237=2048,F237=2052)))),29,VLOOKUP(E237,Lookup!$B$2:$C$13,2,FALSE))","v":31},0,null,null,10]
[null,null,null,10,{"$f":"IF(E237=\"\",\"\",VLOOKUP(E237,Lookup!$A$2:$B$13,2,FALSE))","v":"Apr"},2031,null,null,null,null,null,null,null,null,null,null,null,null,null,null,null,null,null,null,null,null,null,null,null,null,{"$f":"IF(OR(AND(E238=\"Feb\",OR(F238=2020,OR(F238=2024,OR(F238=2028,OR(F238=2032,OR(F238=2036,F238=2040)))))),AND(E238=\"Feb\",OR(F238=2044,OR(F238=2048,F238=2052)))),29,VLOOKUP(E238,Lookup!$B$2:$C$13,2,FALSE))","v":30},0,null,null,10]
[null,null,null,10,{"$f":"IF(E238=\"\",\"\",VLOOKUP(E238,Lookup!$A$2:$B$13,2,FALSE))","v":"May"},2031,null,null,null,null,null,null,null,null,null,null,null,null,null,null,null,null,null,null,null,null,null,null,null,null,{"$f":"IF(OR(AND(E239=\"Feb\",OR(F239=2020,OR(F239=2024,OR(F239=2028,OR(F239=2032,OR(F239=2036,F239=2040)))))),AND(E239=\"Feb\",OR(F239=2044,OR(F239=2048,F239=2052)))),29,VLOOKUP(E239,Lookup!$B$2:$C$13,2,FALSE))","v":31},0,null,null,10]
[null,null,null,10,{"$f":"IF(E239=\"\",\"\",VLOOKUP(E239,Lookup!$A$2:$B$13,2,FALSE))","v":"Jun"},2031,null,null,null,null,null,null,null,null,null,null,null,null,null,null,null,null,null,null,null,null,null,null,null,null,{"$f":"IF(OR(AND(E240=\"Feb\",OR(F240=2020,OR(F240=2024,OR(F240=2028,OR(F240=2032,OR(F240=2036,F240=2040)))))),AND(E240=\"Feb\",OR(F240=2044,OR(F240=2048,F240=2052)))),29,VLOOKUP(E240,Lookup!$B$2:$C$13,2,FALSE))","v":30},0,null,null,10]
[null,null,null,10,{"$f":"IF(E240=\"\",\"\",VLOOKUP(E240,Lookup!$A$2:$B$13,2,FALSE))","v":"Jul"},2031,null,null,null,null,null,null,null,null,null,null,null,null,null,null,null,null,null,null,null,null,null,null,null,null,{"$f":"IF(OR(AND(E241=\"Feb\",OR(F241=2020,OR(F241=2024,OR(F241=2028,OR(F241=2032,OR(F241=2036,F241=2040)))))),AND(E241=\"Feb\",OR(F241=2044,OR(F241=2048,F241=2052)))),29,VLOOKUP(E241,Lookup!$B$2:$C$13,2,FALSE))","v":31},0,null,null,10]
[null,null,null,10,{"$f":"IF(E241=\"\",\"\",VLOOKUP(E241,Lookup!$A$2:$B$13,2,FALSE))","v":"Aug"},2031,null,null,null,null,null,null,null,null,null,null,null,null,null,null,null,null,null,null,null,null,null,null,null,null,{"$f":"IF(OR(AND(E242=\"Feb\",OR(F242=2020,OR(F242=2024,OR(F242=2028,OR(F242=2032,OR(F242=2036,F242=2040)))))),AND(E242=\"Feb\",OR(F242=2044,OR(F242=2048,F242=2052)))),29,VLOOKUP(E242,Lookup!$B$2:$C$13,2,FALSE))","v":31},0,null,null,10]
[null,null,null,10,{"$f":"IF(E242=\"\",\"\",VLOOKUP(E242,Lookup!$A$2:$B$13,2,FALSE))","v":"Sep"},2031,null,null,null,null,null,null,null,null,null,null,null,null,null,null,null,null,null,null,null,null,null,null,null,null,{"$f":"IF(OR(AND(E243=\"Feb\",OR(F243=2020,OR(F243=2024,OR(F243=2028,OR(F243=2032,OR(F243=2036,F243=2040)))))),AND(E243=\"Feb\",OR(F243=2044,OR(F243=2048,F243=2052)))),29,VLOOKUP(E243,Lookup!$B$2:$C$13,2,FALSE))","v":30},0,null,null,10]
[null,null,null,10,{"$f":"IF(E243=\"\",\"\",VLOOKUP(E243,Lookup!$A$2:$B$13,2,FALSE))","v":"Oct"},2031,null,null,null,null,null,null,null,null,null,null,null,null,null,null,null,null,null,null,null,null,null,null,null,null,{"$f":"IF(OR(AND(E244=\"Feb\",OR(F244=2020,OR(F244=2024,OR(F244=2028,OR(F244=2032,OR(F244=2036,F244=2040)))))),AND(E244=\"Feb\",OR(F244=2044,OR(F244=2048,F244=2052)))),29,VLOOKUP(E244,Lookup!$B$2:$C$13,2,FALSE))","v":31},0,null,null,10]
[null,null,null,10,{"$f":"IF(E244=\"\",\"\",VLOOKUP(E244,Lookup!$A$2:$B$13,2,FALSE))","v":"Nov"},2031,null,null,null,null,null,null,null,null,null,null,null,null,null,null,null,null,null,null,null,null,null,null,null,null,{"$f":"IF(OR(AND(E245=\"Feb\",OR(F245=2020,OR(F245=2024,OR(F245=2028,OR(F245=2032,OR(F245=2036,F245=2040)))))),AND(E245=\"Feb\",OR(F245=2044,OR(F245=2048,F245=2052)))),29,VLOOKUP(E245,Lookup!$B$2:$C$13,2,FALSE))","v":30},0,null,null,10]
[null,null,null,10,{"$f":"IF(E245=\"\",\"\",VLOOKUP(E245,Lookup!$A$2:$B$13,2,FALSE))","v":"Dec"},2031,null,null,null,null,null,null,null,null,null,null,null,null,null,null,null,null,null,null,null,null,null,null,null,null,{"$f":"IF(OR(AND(E246=\"Feb\",OR(F246=2020,OR(F246=2024,OR(F246=2028,OR(F246=2032,OR(F246=2036,F246=2040)))))),AND(E246=\"Feb\",OR(F246=2044,OR(F246=2048,F246=2052)))),29,VLOOKUP(E246,Lookup!$B$2:$C$13,2,FALSE))","v":31},0,null,null,10]
[null,null,null,11,{"$f":"IF(E246=\"\",\"\",VLOOKUP(E246,Lookup!$A$2:$B$13,2,FALSE))","v":"Jan"},2032,null,null,null,null,null,null,null,null,null,null,null,null,null,null,null,null,null,null,null,null,null,null,null,null,{"$f":"IF(OR(AND(E247=\"Feb\",OR(F247=2020,OR(F247=2024,OR(F247=2028,OR(F247=2032,OR(F247=2036,F247=2040)))))),AND(E247=\"Feb\",OR(F247=2044,OR(F247=2048,F247=2052)))),29,VLOOKUP(E247,Lookup!$B$2:$C$13,2,FALSE))","v":31},0,null,null,{"$f":"+D247","v":11}]
[null,null,null,11,{"$f":"IF(E247=\"\",\"\",VLOOKUP(E247,Lookup!$A$2:$B$13,2,FALSE))","v":"Feb"},2032,null,null,null,null,null,null,null,null,null,null,null,null,null,null,null,null,null,null,null,null,null,null,null,null,{"$f":"IF(OR(AND(E248=\"Feb\",OR(F248=2020,OR(F248=2024,OR(F248=2028,OR(F248=2032,OR(F248=2036,F248=2040)))))),AND(E248=\"Feb\",OR(F248=2044,OR(F248=2048,F248=2052)))),29,VLOOKUP(E248,Lookup!$B$2:$C$13,2,FALSE))","v":29},0,null,null,{"$f":"+D248","v":11}]
[null,null,null,11,{"$f":"IF(E248=\"\",\"\",VLOOKUP(E248,Lookup!$A$2:$B$13,2,FALSE))","v":"Mar"},2032,null,null,null,null,null,null,null,null,null,null,null,null,null,null,null,null,null,null,null,null,null,null,null,null,{"$f":"IF(OR(AND(E249=\"Feb\",OR(F249=2020,OR(F249=2024,OR(F249=2028,OR(F249=2032,OR(F249=2036,F249=2040)))))),AND(E249=\"Feb\",OR(F249=2044,OR(F249=2048,F249=2052)))),29,VLOOKUP(E249,Lookup!$B$2:$C$13,2,FALSE))","v":31},0,null,null,11]
[null,null,null,11,{"$f":"IF(E249=\"\",\"\",VLOOKUP(E249,Lookup!$A$2:$B$13,2,FALSE))","v":"Apr"},2032,null,null,null,null,null,null,null,null,null,null,null,null,null,null,null,null,null,null,null,null,null,null,null,null,{"$f":"IF(OR(AND(E250=\"Feb\",OR(F250=2020,OR(F250=2024,OR(F250=2028,OR(F250=2032,OR(F250=2036,F250=2040)))))),AND(E250=\"Feb\",OR(F250=2044,OR(F250=2048,F250=2052)))),29,VLOOKUP(E250,Lookup!$B$2:$C$13,2,FALSE))","v":30},0,null,null,11]
[null,null,null,11,{"$f":"IF(E250=\"\",\"\",VLOOKUP(E250,Lookup!$A$2:$B$13,2,FALSE))","v":"May"},2032,null,null,null,null,null,null,null,null,null,null,null,null,null,null,null,null,null,null,null,null,null,null,null,null,{"$f":"IF(OR(AND(E251=\"Feb\",OR(F251=2020,OR(F251=2024,OR(F251=2028,OR(F251=2032,OR(F251=2036,F251=2040)))))),AND(E251=\"Feb\",OR(F251=2044,OR(F251=2048,F251=2052)))),29,VLOOKUP(E251,Lookup!$B$2:$C$13,2,FALSE))","v":31},0,null,null,11]
[null,null,null,11,{"$f":"IF(E251=\"\",\"\",VLOOKUP(E251,Lookup!$A$2:$B$13,2,FALSE))","v":"Jun"},2032,null,null,null,null,null,null,null,null,null,null,null,null,null,null,null,null,null,null,null,null,null,null,null,null,{"$f":"IF(OR(AND(E252=\"Feb\",OR(F252=2020,OR(F252=2024,OR(F252=2028,OR(F252=2032,OR(F252=2036,F252=2040)))))),AND(E252=\"Feb\",OR(F252=2044,OR(F252=2048,F252=2052)))),29,VLOOKUP(E252,Lookup!$B$2:$C$13,2,FALSE))","v":30},0,null,null,11]
[null,null,null,11,{"$f":"IF(E252=\"\",\"\",VLOOKUP(E252,Lookup!$A$2:$B$13,2,FALSE))","v":"Jul"},2032,null,null,null,null,null,null,null,null,null,null,null,null,null,null,null,null,null,null,null,null,null,null,null,null,{"$f":"IF(OR(AND(E253=\"Feb\",OR(F253=2020,OR(F253=2024,OR(F253=2028,OR(F253=2032,OR(F253=2036,F253=2040)))))),AND(E253=\"Feb\",OR(F253=2044,OR(F253=2048,F253=2052)))),29,VLOOKUP(E253,Lookup!$B$2:$C$13,2,FALSE))","v":31},0,null,null,11]
[null,null,null,11,{"$f":"IF(E253=\"\",\"\",VLOOKUP(E253,Lookup!$A$2:$B$13,2,FALSE))","v":"Aug"},2032,null,null,null,null,null,null,null,null,null,null,null,null,null,null,null,null,null,null,null,null,null,null,null,null,{"$f":"IF(OR(AND(E254=\"Feb\",OR(F254=2020,OR(F254=2024,OR(F254=2028,OR(F254=2032,OR(F254=2036,F254=2040)))))),AND(E254=\"Feb\",OR(F254=2044,OR(F254=2048,F254=2052)))),29,VLOOKUP(E254,Lookup!$B$2:$C$13,2,FALSE))","v":31},0,null,null,11]
[null,null,null,11,{"$f":"IF(E254=\"\",\"\",VLOOKUP(E254,Lookup!$A$2:$B$13,2,FALSE))","v":"Sep"},2032,null,null,null,null,null,null,null,null,null,null,null,null,null,null,null,null,null,null,null,null,null,null,null,null,{"$f":"IF(OR(AND(E255=\"Feb\",OR(F255=2020,OR(F255=2024,OR(F255=2028,OR(F255=2032,OR(F255=2036,F255=2040)))))),AND(E255=\"Feb\",OR(F255=2044,OR(F255=2048,F255=2052)))),29,VLOOKUP(E255,Lookup!$B$2:$C$13,2,FALSE))","v":30},{"$f":"SUM(G255:AD255)*AE255","v":0},null,null,11]
[null,null,null,11,{"$f":"IF(E255=\"\",\"\",VLOOKUP(E255,Lookup!$A$2:$B$13,2,FALSE))","v":"Oct"},2032,null,null,null,null,null,null,null,null,null,null,null,null,null,null,null,null,null,null,null,null,null,null,null,null,{"$f":"IF(OR(AND(E256=\"Feb\",OR(F256=2020,OR(F256=2024,OR(F256=2028,OR(F256=2032,OR(F256=2036,F256=2040)))))),AND(E256=\"Feb\",OR(F256=2044,OR(F256=2048,F256=2052)))),29,VLOOKUP(E256,Lookup!$B$2:$C$13,2,FALSE))","v":31},0,null,null,11]
[null,null,null,11,{"$f":"IF(E256=\"\",\"\",VLOOKUP(E256,Lookup!$A$2:$B$13,2,FALSE))","v":"Nov"},2032,null,null,null,null,null,null,null,null,null,null,null,null,null,null,null,null,null,null,null,null,null,null,null,null,{"$f":"IF(OR(AND(E257=\"Feb\",OR(F257=2020,OR(F257=2024,OR(F257=2028,OR(F257=2032,OR(F257=2036,F257=2040)))))),AND(E257=\"Feb\",OR(F257=2044,OR(F257=2048,F257=2052)))),29,VLOOKUP(E257,Lookup!$B$2:$C$13,2,FALSE))","v":30},0,null,null,11]
[null,null,null,11,{"$f":"IF(E257=\"\",\"\",VLOOKUP(E257,Lookup!$A$2:$B$13,2,FALSE))","v":"Dec"},2032,null,null,null,null,null,null,null,null,null,null,null,null,null,null,null,null,null,null,null,null,null,null,null,null,{"$f":"IF(OR(AND(E258=\"Feb\",OR(F258=2020,OR(F258=2024,OR(F258=2028,OR(F258=2032,OR(F258=2036,F258=2040)))))),AND(E258=\"Feb\",OR(F258=2044,OR(F258=2048,F258=2052)))),29,VLOOKUP(E258,Lookup!$B$2:$C$13,2,FALSE))","v":31},0,null,null,11]
[null,null,null,12,{"$f":"IF(E258=\"\",\"\",VLOOKUP(E258,Lookup!$A$2:$B$13,2,FALSE))","v":"Jan"},2033,null,null,null,null,null,null,null,null,null,null,null,null,null,null,null,null,null,null,null,null,null,null,null,null,{"$f":"IF(OR(AND(E259=\"Feb\",OR(F259=2020,OR(F259=2024,OR(F259=2028,OR(F259=2032,OR(F259=2036,F259=2040)))))),AND(E259=\"Feb\",OR(F259=2044,OR(F259=2048,F259=2052)))),29,VLOOKUP(E259,Lookup!$B$2:$C$13,2,FALSE))","v":31},0,null,null,12]
[null,null,null,12,{"$f":"IF(E259=\"\",\"\",VLOOKUP(E259,Lookup!$A$2:$B$13,2,FALSE))","v":"Feb"},2033,null,null,null,null,null,null,null,null,null,null,null,null,null,null,null,null,null,null,null,null,null,null,null,null,{"$f":"IF(OR(AND(E260=\"Feb\",OR(F260=2020,OR(F260=2024,OR(F260=2028,OR(F260=2032,OR(F260=2036,F260=2040)))))),AND(E260=\"Feb\",OR(F260=2044,OR(F260=2048,F260=2052)))),29,VLOOKUP(E260,Lookup!$B$2:$C$13,2,FALSE))","v":28},0,null,null,12]
[null,null,null,12,{"$f":"IF(E260=\"\",\"\",VLOOKUP(E260,Lookup!$A$2:$B$13,2,FALSE))","v":"Mar"},2033,null,null,null,null,null,null,null,null,null,null,null,null,null,null,null,null,null,null,null,null,null,null,null,null,{"$f":"IF(OR(AND(E261=\"Feb\",OR(F261=2020,OR(F261=2024,OR(F261=2028,OR(F261=2032,OR(F261=2036,F261=2040)))))),AND(E261=\"Feb\",OR(F261=2044,OR(F261=2048,F261=2052)))),29,VLOOKUP(E261,Lookup!$B$2:$C$13,2,FALSE))","v":31},0,null,null,12]
[null,null,null,12,{"$f":"IF(E261=\"\",\"\",VLOOKUP(E261,Lookup!$A$2:$B$13,2,FALSE))","v":"Apr"},2033,null,null,null,null,null,null,null,null,null,null,null,null,null,null,null,null,null,null,null,null,null,null,null,null,{"$f":"IF(OR(AND(E262=\"Feb\",OR(F262=2020,OR(F262=2024,OR(F262=2028,OR(F262=2032,OR(F262=2036,F262=2040)))))),AND(E262=\"Feb\",OR(F262=2044,OR(F262=2048,F262=2052)))),29,VLOOKUP(E262,Lookup!$B$2:$C$13,2,FALSE))","v":30},0,null,null,12]
[null,null,null,12,{"$f":"IF(E262=\"\",\"\",VLOOKUP(E262,Lookup!$A$2:$B$13,2,FALSE))","v":"May"},2033,null,null,null,null,null,null,null,null,null,null,null,null,null,null,null,null,null,null,null,null,null,null,null,null,{"$f":"IF(OR(AND(E263=\"Feb\",OR(F263=2020,OR(F263=2024,OR(F263=2028,OR(F263=2032,OR(F263=2036,F263=2040)))))),AND(E263=\"Feb\",OR(F263=2044,OR(F263=2048,F263=2052)))),29,VLOOKUP(E263,Lookup!$B$2:$C$13,2,FALSE))","v":31},0,null,null,12]
[null,null,null,12,{"$f":"IF(E263=\"\",\"\",VLOOKUP(E263,Lookup!$A$2:$B$13,2,FALSE))","v":"Jun"},2033,null,null,null,null,null,null,null,null,null,null,null,null,null,null,null,null,null,null,null,null,null,null,null,null,{"$f":"IF(OR(AND(E264=\"Feb\",OR(F264=2020,OR(F264=2024,OR(F264=2028,OR(F264=2032,OR(F264=2036,F264=2040)))))),AND(E264=\"Feb\",OR(F264=2044,OR(F264=2048,F264=2052)))),29,VLOOKUP(E264,Lookup!$B$2:$C$13,2,FALSE))","v":30},0,null,null,12]
[null,null,null,12,{"$f":"IF(E264=\"\",\"\",VLOOKUP(E264,Lookup!$A$2:$B$13,2,FALSE))","v":"Jul"},2033,null,null,null,null,null,null,null,null,null,null,null,null,null,null,null,null,null,null,null,null,null,null,null,null,{"$f":"IF(OR(AND(E265=\"Feb\",OR(F265=2020,OR(F265=2024,OR(F265=2028,OR(F265=2032,OR(F265=2036,F265=2040)))))),AND(E265=\"Feb\",OR(F265=2044,OR(F265=2048,F265=2052)))),29,VLOOKUP(E265,Lookup!$B$2:$C$13,2,FALSE))","v":31},0,null,null,12]
[null,null,null,12,{"$f":"IF(E265=\"\",\"\",VLOOKUP(E265,Lookup!$A$2:$B$13,2,FALSE))","v":"Aug"},2033,null,null,null,null,null,null,null,null,null,null,null,null,null,null,null,null,null,null,null,null,null,null,null,null,{"$f":"IF(OR(AND(E266=\"Feb\",OR(F266=2020,OR(F266=2024,OR(F266=2028,OR(F266=2032,OR(F266=2036,F266=2040)))))),AND(E266=\"Feb\",OR(F266=2044,OR(F266=2048,F266=2052)))),29,VLOOKUP(E266,Lookup!$B$2:$C$13,2,FALSE))","v":31},0,null,null,12]
[null,null,null,12,{"$f":"IF(E266=\"\",\"\",VLOOKUP(E266,Lookup!$A$2:$B$13,2,FALSE))","v":"Sep"},2033,null,null,null,null,null,null,null,null,null,null,null,null,null,null,null,null,null,null,null,null,null,null,null,null,{"$f":"IF(OR(AND(E267=\"Feb\",OR(F267=2020,OR(F267=2024,OR(F267=2028,OR(F267=2032,OR(F267=2036,F267=2040)))))),AND(E267=\"Feb\",OR(F267=2044,OR(F267=2048,F267=2052)))),29,VLOOKUP(E267,Lookup!$B$2:$C$13,2,FALSE))","v":30},0,null,null,12]
[null,null,null,{"$f":"+D256+1","v":12},{"$f":"IF(E267=\"\",\"\",VLOOKUP(E267,Lookup!$A$2:$B$13,2,FALSE))","v":"Oct"},{"$f":"IF(E267=0,\"\",IF(E267=\"Dec\",F267+1,F267))","v":2033},null,null,null,null,null,null,null,null,null,null,null,null,null,null,null,null,null,null,null,null,null,null,null,null,{"$f":"IF(OR(AND(E268=\"Feb\",OR(F268=2020,OR(F268=2024,OR(F268=2028,OR(F268=2032,OR(F268=2036,F268=2040)))))),AND(E268=\"Feb\",OR(F268=2044,OR(F268=2048,F268=2052)))),29,VLOOKUP(E268,Lookup!$B$2:$C$13,2,FALSE))","v":31},0,null,null,12]
[null,null,null,12,{"$f":"IF(E268=\"\",\"\",VLOOKUP(E268,Lookup!$A$2:$B$13,2,FALSE))","v":"Nov"},2033,null,null,null,null,null,null,null,null,null,null,null,null,null,null,null,null,null,null,null,null,null,null,null,null,{"$f":"IF(OR(AND(E269=\"Feb\",OR(F269=2020,OR(F269=2024,OR(F269=2028,OR(F269=2032,OR(F269=2036,F269=2040)))))),AND(E269=\"Feb\",OR(F269=2044,OR(F269=2048,F269=2052)))),29,VLOOKUP(E269,Lookup!$B$2:$C$13,2,FALSE))","v":30},0,null,null,12]
[null,null,null,12,{"$f":"IF(E269=\"\",\"\",VLOOKUP(E269,Lookup!$A$2:$B$13,2,FALSE))","v":"Dec"},2033,null,null,null,null,null,null,null,null,null,null,null,null,null,null,null,null,null,null,null,null,null,null,null,null,{"$f":"IF(OR(AND(E270=\"Feb\",OR(F270=2020,OR(F270=2024,OR(F270=2028,OR(F270=2032,OR(F270=2036,F270=2040)))))),AND(E270=\"Feb\",OR(F270=2044,OR(F270=2048,F270=2052)))),29,VLOOKUP(E270,Lookup!$B$2:$C$13,2,FALSE))","v":31},0,null,null,12]
[null,null,null,13,{"$f":"IF(E270=\"\",\"\",VLOOKUP(E270,Lookup!$A$2:$B$13,2,FALSE))","v":"Jan"},2034,null,null,null,null,null,null,null,null,null,null,null,null,null,null,null,null,null,null,null,null,null,null,null,null,{"$f":"IF(OR(AND(E271=\"Feb\",OR(F271=2020,OR(F271=2024,OR(F271=2028,OR(F271=2032,OR(F271=2036,F271=2040)))))),AND(E271=\"Feb\",OR(F271=2044,OR(F271=2048,F271=2052)))),29,VLOOKUP(E271,Lookup!$B$2:$C$13,2,FALSE))","v":31},0,null,null,{"$f":"+D271","v":13}]
[null,null,null,13,{"$f":"IF(E271=\"\",\"\",VLOOKUP(E271,Lookup!$A$2:$B$13,2,FALSE))","v":"Feb"},2034,null,null,null,null,null,null,null,null,null,null,null,null,null,null,null,null,null,null,null,null,null,null,null,null,{"$f":"IF(OR(AND(E272=\"Feb\",OR(F272=2020,OR(F272=2024,OR(F272=2028,OR(F272=2032,OR(F272=2036,F272=2040)))))),AND(E272=\"Feb\",OR(F272=2044,OR(F272=2048,F272=2052)))),29,VLOOKUP(E272,Lookup!$B$2:$C$13,2,FALSE))","v":28},0,null,null,{"$f":"+D272","v":13}]
[null,null,null,13,{"$f":"IF(E272=\"\",\"\",VLOOKUP(E272,Lookup!$A$2:$B$13,2,FALSE))","v":"Mar"},2034,null,null,null,null,null,null,null,null,null,null,null,null,null,null,null,null,null,null,null,null,null,null,null,null,{"$f":"IF(OR(AND(E273=\"Feb\",OR(F273=2020,OR(F273=2024,OR(F273=2028,OR(F273=2032,OR(F273=2036,F273=2040)))))),AND(E273=\"Feb\",OR(F273=2044,OR(F273=2048,F273=2052)))),29,VLOOKUP(E273,Lookup!$B$2:$C$13,2,FALSE))","v":31},0,null,null,13]
[null,null,null,13,{"$f":"IF(E273=\"\",\"\",VLOOKUP(E273,Lookup!$A$2:$B$13,2,FALSE))","v":"Apr"},2034,null,null,null,null,null,null,null,null,null,null,null,null,null,null,null,null,null,null,null,null,null,null,null,null,{"$f":"IF(OR(AND(E274=\"Feb\",OR(F274=2020,OR(F274=2024,OR(F274=2028,OR(F274=2032,OR(F274=2036,F274=2040)))))),AND(E274=\"Feb\",OR(F274=2044,OR(F274=2048,F274=2052)))),29,VLOOKUP(E274,Lookup!$B$2:$C$13,2,FALSE))","v":30},0,null,null,13]
[null,null,null,13,{"$f":"IF(E274=\"\",\"\",VLOOKUP(E274,Lookup!$A$2:$B$13,2,FALSE))","v":"May"},2034,null,null,null,null,null,null,null,null,null,null,null,null,null,null,null,null,null,null,null,null,null,null,null,null,{"$f":"IF(OR(AND(E275=\"Feb\",OR(F275=2020,OR(F275=2024,OR(F275=2028,OR(F275=2032,OR(F275=2036,F275=2040)))))),AND(E275=\"Feb\",OR(F275=2044,OR(F275=2048,F275=2052)))),29,VLOOKUP(E275,Lookup!$B$2:$C$13,2,FALSE))","v":31},0,null,null,13]
[null,null,null,13,{"$f":"IF(E275=\"\",\"\",VLOOKUP(E275,Lookup!$A$2:$B$13,2,FALSE))","v":"Jun"},2034,null,null,null,null,null,null,null,null,null,null,null,null,null,null,null,null,null,null,null,null,null,null,null,null,{"$f":"IF(OR(AND(E276=\"Feb\",OR(F276=2020,OR(F276=2024,OR(F276=2028,OR(F276=2032,OR(F276=2036,F276=2040)))))),AND(E276=\"Feb\",OR(F276=2044,OR(F276=2048,F276=2052)))),29,VLOOKUP(E276,Lookup!$B$2:$C$13,2,FALSE))","v":30},0,null,null,13]
[null,null,null,13,{"$f":"IF(E276=\"\",\"\",VLOOKUP(E276,Lookup!$A$2:$B$13,2,FALSE))","v":"Jul"},2034,null,null,null,null,null,null,null,null,null,null,null,null,null,null,null,null,null,null,null,null,null,null,null,null,{"$f":"IF(OR(AND(E277=\"Feb\",OR(F277=2020,OR(F277=2024,OR(F277=2028,OR(F277=2032,OR(F277=2036,F277=2040)))))),AND(E277=\"Feb\",OR(F277=2044,OR(F277=2048,F277=2052)))),29,VLOOKUP(E277,Lookup!$B$2:$C$13,2,FALSE))","v":31},0,null,null,13]
[null,null,null,13,{"$f":"IF(E277=\"\",\"\",VLOOKUP(E277,Lookup!$A$2:$B$13,2,FALSE))","v":"Aug"},2034,null,null,null,null,null,null,null,null,null,null,null,null,null,null,null,null,null,null,null,null,null,null,null,null,{"$f":"IF(OR(AND(E278=\"Feb\",OR(F278=2020,OR(F278=2024,OR(F278=2028,OR(F278=2032,OR(F278=2036,F278=2040)))))),AND(E278=\"Feb\",OR(F278=2044,OR(F278=2048,F278=2052)))),29,VLOOKUP(E278,Lookup!$B$2:$C$13,2,FALSE))","v":31},0,null,null,13]
[null,null,null,13,{"$f":"IF(E278=\"\",\"\",VLOOKUP(E278,Lookup!$A$2:$B$13,2,FALSE))","v":"Sep"},2034,null,null,null,null,null,null,null,null,null,null,null,null,null,null,null,null,null,null,null,null,null,null,null,null,{"$f":"IF(OR(AND(E279=\"Feb\",OR(F279=2020,OR(F279=2024,OR(F279=2028,OR(F279=2032,OR(F279=2036,F279=2040)))))),AND(E279=\"Feb\",OR(F279=2044,OR(F279=2048,F279=2052)))),29,VLOOKUP(E279,Lookup!$B$2:$C$13,2,FALSE))","v":30},0,null,null,13]
[null,null,null,13,{"$f":"IF(E279=\"\",\"\",VLOOKUP(E279,Lookup!$A$2:$B$13,2,FALSE))","v":"Oct"},2034,null,null,null,null,null,null,null,null,null,null,null,null,null,null,null,null,null,null,null,null,null,null,null,null,{"$f":"IF(OR(AND(E280=\"Feb\",OR(F280=2020,OR(F280=2024,OR(F280=2028,OR(F280=2032,OR(F280=2036,F280=2040)))))),AND(E280=\"Feb\",OR(F280=2044,OR(F280=2048,F280=2052)))),29,VLOOKUP(E280,Lookup!$B$2:$C$13,2,FALSE))","v":31},0,null,null,13]
[null,null,null,13,{"$f":"IF(E280=\"\",\"\",VLOOKUP(E280,Lookup!$A$2:$B$13,2,FALSE))","v":"Nov"},2034,null,null,null,null,null,null,null,null,null,null,null,null,null,null,null,null,null,null,null,null,null,null,null,null,{"$f":"IF(OR(AND(E281=\"Feb\",OR(F281=2020,OR(F281=2024,OR(F281=2028,OR(F281=2032,OR(F281=2036,F281=2040)))))),AND(E281=\"Feb\",OR(F281=2044,OR(F281=2048,F281=2052)))),29,VLOOKUP(E281,Lookup!$B$2:$C$13,2,FALSE))","v":30},0,null,null,13]
[null,null,null,13,{"$f":"IF(E281=\"\",\"\",VLOOKUP(E281,Lookup!$A$2:$B$13,2,FALSE))","v":"Dec"},2034,null,null,null,null,null,null,null,null,null,null,null,null,null,null,null,null,null,null,null,null,null,null,null,null,{"$f":"IF(OR(AND(E282=\"Feb\",OR(F282=2020,OR(F282=2024,OR(F282=2028,OR(F282=2032,OR(F282=2036,F282=2040)))))),AND(E282=\"Feb\",OR(F282=2044,OR(F282=2048,F282=2052)))),29,VLOOKUP(E282,Lookup!$B$2:$C$13,2,FALSE))","v":31},0,null,null,13]
[null,null,null,14,{"$f":"IF(E282=\"\",\"\",VLOOKUP(E282,Lookup!$A$2:$B$13,2,FALSE))","v":"Jan"},2035,null,null,null,null,null,null,null,null,null,null,null,null,null,null,null,null,null,null,null,null,null,null,null,null,{"$f":"IF(OR(AND(E283=\"Feb\",OR(F283=2020,OR(F283=2024,OR(F283=2028,OR(F283=2032,OR(F283=2036,F283=2040)))))),AND(E283=\"Feb\",OR(F283=2044,OR(F283=2048,F283=2052)))),29,VLOOKUP(E283,Lookup!$B$2:$C$13,2,FALSE))","v":31},0,null,null,14]
[null,null,null,14,{"$f":"IF(E283=\"\",\"\",VLOOKUP(E283,Lookup!$A$2:$B$13,2,FALSE))","v":"Feb"},2035,null,null,null,null,null,null,null,null,null,null,null,null,null,null,null,null,null,null,null,null,null,null,null,null,{"$f":"IF(OR(AND(E284=\"Feb\",OR(F284=2020,OR(F284=2024,OR(F284=2028,OR(F284=2032,OR(F284=2036,F284=2040)))))),AND(E284=\"Feb\",OR(F284=2044,OR(F284=2048,F284=2052)))),29,VLOOKUP(E284,Lookup!$B$2:$C$13,2,FALSE))","v":28},0,null,null,14]
[null,null,null,14,{"$f":"IF(E284=\"\",\"\",VLOOKUP(E284,Lookup!$A$2:$B$13,2,FALSE))","v":"Mar"},2035,null,null,null,null,null,null,null,null,null,null,null,null,null,null,null,null,null,null,null,null,null,null,null,null,{"$f":"IF(OR(AND(E285=\"Feb\",OR(F285=2020,OR(F285=2024,OR(F285=2028,OR(F285=2032,OR(F285=2036,F285=2040)))))),AND(E285=\"Feb\",OR(F285=2044,OR(F285=2048,F285=2052)))),29,VLOOKUP(E285,Lookup!$B$2:$C$13,2,FALSE))","v":31},0,null,null,14]
[null,null,null,14,{"$f":"IF(E285=\"\",\"\",VLOOKUP(E285,Lookup!$A$2:$B$13,2,FALSE))","v":"Apr"},2035,null,null,null,null,null,null,null,null,null,null,null,null,null,null,null,null,null,null,null,null,null,null,null,null,{"$f":"IF(OR(AND(E286=\"Feb\",OR(F286=2020,OR(F286=2024,OR(F286=2028,OR(F286=2032,OR(F286=2036,F286=2040)))))),AND(E286=\"Feb\",OR(F286=2044,OR(F286=2048,F286=2052)))),29,VLOOKUP(E286,Lookup!$B$2:$C$13,2,FALSE))","v":30},0,null,null,14]
[null,null,null,14,{"$f":"IF(E286=\"\",\"\",VLOOKUP(E286,Lookup!$A$2:$B$13,2,FALSE))","v":"May"},2035,null,null,null,null,null,null,null,null,null,null,null,null,null,null,null,null,null,null,null,null,null,null,null,null,{"$f":"IF(OR(AND(E287=\"Feb\",OR(F287=2020,OR(F287=2024,OR(F287=2028,OR(F287=2032,OR(F287=2036,F287=2040)))))),AND(E287=\"Feb\",OR(F287=2044,OR(F287=2048,F287=2052)))),29,VLOOKUP(E287,Lookup!$B$2:$C$13,2,FALSE))","v":31},0,null,null,14]
[null,null,null,14,{"$f":"IF(E287=\"\",\"\",VLOOKUP(E287,Lookup!$A$2:$B$13,2,FALSE))","v":"Jun"},2035,null,null,null,null,null,null,null,null,null,null,null,null,null,null,null,null,null,null,null,null,null,null,null,null,{"$f":"IF(OR(AND(E288=\"Feb\",OR(F288=2020,OR(F288=2024,OR(F288=2028,OR(F288=2032,OR(F288=2036,F288=2040)))))),AND(E288=\"Feb\",OR(F288=2044,OR(F288=2048,F288=2052)))),29,VLOOKUP(E288,Lookup!$B$2:$C$13,2,FALSE))","v":30},0,null,null,14]
[null,null,null,14,{"$f":"IF(E288=\"\",\"\",VLOOKUP(E288,Lookup!$A$2:$B$13,2,FALSE))","v":"Jul"},2035,null,null,null,null,null,null,null,null,null,null,null,null,null,null,null,null,null,null,null,null,null,null,null,null,{"$f":"IF(OR(AND(E289=\"Feb\",OR(F289=2020,OR(F289=2024,OR(F289=2028,OR(F289=2032,OR(F289=2036,F289=2040)))))),AND(E289=\"Feb\",OR(F289=2044,OR(F289=2048,F289=2052)))),29,VLOOKUP(E289,Lookup!$B$2:$C$13,2,FALSE))","v":31},0,null,null,14]
[null,null,null,14,{"$f":"IF(E289=\"\",\"\",VLOOKUP(E289,Lookup!$A$2:$B$13,2,FALSE))","v":"Aug"},2035,null,null,null,null,null,null,null,null,null,null,null,null,null,null,null,null,null,null,null,null,null,null,null,null,{"$f":"IF(OR(AND(E290=\"Feb\",OR(F290=2020,OR(F290=2024,OR(F290=2028,OR(F290=2032,OR(F290=2036,F290=2040)))))),AND(E290=\"Feb\",OR(F290=2044,OR(F290=2048,F290=2052)))),29,VLOOKUP(E290,Lookup!$B$2:$C$13,2,FALSE))","v":31},0,null,null,14]
[null,null,null,14,{"$f":"IF(E290=\"\",\"\",VLOOKUP(E290,Lookup!$A$2:$B$13,2,FALSE))","v":"Sep"},2035,null,null,null,null,null,null,null,null,null,null,null,null,null,null,null,null,null,null,null,null,null,null,null,null,{"$f":"IF(OR(AND(E291=\"Feb\",OR(F291=2020,OR(F291=2024,OR(F291=2028,OR(F291=2032,OR(F291=2036,F291=2040)))))),AND(E291=\"Feb\",OR(F291=2044,OR(F291=2048,F291=2052)))),29,VLOOKUP(E291,Lookup!$B$2:$C$13,2,FALSE))","v":30},0,null,null,14]
[null,null,null,14,{"$f":"IF(E291=\"\",\"\",VLOOKUP(E291,Lookup!$A$2:$B$13,2,FALSE))","v":"Oct"},2035,null,null,null,null,null,null,null,null,null,null,null,null,null,null,null,null,null,null,null,null,null,null,null,null,{"$f":"IF(OR(AND(E292=\"Feb\",OR(F292=2020,OR(F292=2024,OR(F292=2028,OR(F292=2032,OR(F292=2036,F292=2040)))))),AND(E292=\"Feb\",OR(F292=2044,OR(F292=2048,F292=2052)))),29,VLOOKUP(E292,Lookup!$B$2:$C$13,2,FALSE))","v":31},0,null,null,14]
[null,null,null,14,{"$f":"IF(E292=\"\",\"\",VLOOKUP(E292,Lookup!$A$2:$B$13,2,FALSE))","v":"Nov"},2035,null,null,null,null,null,null,null,null,null,null,null,null,null,null,null,null,null,null,null,null,null,null,null,null,{"$f":"IF(OR(AND(E293=\"Feb\",OR(F293=2020,OR(F293=2024,OR(F293=2028,OR(F293=2032,OR(F293=2036,F293=2040)))))),AND(E293=\"Feb\",OR(F293=2044,OR(F293=2048,F293=2052)))),29,VLOOKUP(E293,Lookup!$B$2:$C$13,2,FALSE))","v":30},0,null,null,14]
[null,null,null,14,{"$f":"IF(E293=\"\",\"\",VLOOKUP(E293,Lookup!$A$2:$B$13,2,FALSE))","v":"Dec"},2035,null,null,null,null,null,null,null,null,null,null,null,null,null,null,null,null,null,null,null,null,null,null,null,null,{"$f":"IF(OR(AND(E294=\"Feb\",OR(F294=2020,OR(F294=2024,OR(F294=2028,OR(F294=2032,OR(F294=2036,F294=2040)))))),AND(E294=\"Feb\",OR(F294=2044,OR(F294=2048,F294=2052)))),29,VLOOKUP(E294,Lookup!$B$2:$C$13,2,FALSE))","v":31},0,null,null,14]
[null,null,null,15,{"$f":"IF(E294=\"\",\"\",VLOOKUP(E294,Lookup!$A$2:$B$13,2,FALSE))","v":"Jan"},2036,null,null,null,null,null,null,null,null,null,null,null,null,null,null,null,null,null,null,null,null,null,null,null,null,{"$f":"IF(OR(AND(E295=\"Feb\",OR(F295=2020,OR(F295=2024,OR(F295=2028,OR(F295=2032,OR(F295=2036,F295=2040)))))),AND(E295=\"Feb\",OR(F295=2044,OR(F295=2048,F295=2052)))),29,VLOOKUP(E295,Lookup!$B$2:$C$13,2,FALSE))","v":31},0,null,null,{"$f":"+D295","v":15}]
[null,null,null,15,{"$f":"IF(E295=\"\",\"\",VLOOKUP(E295,Lookup!$A$2:$B$13,2,FALSE))","v":"Feb"},2036,null,null,null,null,null,null,null,null,null,null,null,null,null,null,null,null,null,null,null,null,null,null,null,null,{"$f":"IF(OR(AND(E296=\"Feb\",OR(F296=2020,OR(F296=2024,OR(F296=2028,OR(F296=2032,OR(F296=2036,F296=2040)))))),AND(E296=\"Feb\",OR(F296=2044,OR(F296=2048,F296=2052)))),29,VLOOKUP(E296,Lookup!$B$2:$C$13,2,FALSE))","v":29},0,null,null,15]
[null,null,null,15,{"$f":"IF(E296=\"\",\"\",VLOOKUP(E296,Lookup!$A$2:$B$13,2,FALSE))","v":"Mar"},2036,null,null,null,null,null,null,null,null,null,null,null,null,null,null,null,null,null,null,null,null,null,null,null,null,{"$f":"IF(OR(AND(E297=\"Feb\",OR(F297=2020,OR(F297=2024,OR(F297=2028,OR(F297=2032,OR(F297=2036,F297=2040)))))),AND(E297=\"Feb\",OR(F297=2044,OR(F297=2048,F297=2052)))),29,VLOOKUP(E297,Lookup!$B$2:$C$13,2,FALSE))","v":31},0,null,null,15]
[null,null,null,15,{"$f":"IF(E297=\"\",\"\",VLOOKUP(E297,Lookup!$A$2:$B$13,2,FALSE))","v":"Apr"},2036,null,null,null,null,null,null,null,null,null,null,null,null,null,null,null,null,null,null,null,null,null,null,null,null,{"$f":"IF(OR(AND(E298=\"Feb\",OR(F298=2020,OR(F298=2024,OR(F298=2028,OR(F298=2032,OR(F298=2036,F298=2040)))))),AND(E298=\"Feb\",OR(F298=2044,OR(F298=2048,F298=2052)))),29,VLOOKUP(E298,Lookup!$B$2:$C$13,2,FALSE))","v":30},0,null,null,15]
[null,null,null,15,{"$f":"IF(E298=\"\",\"\",VLOOKUP(E298,Lookup!$A$2:$B$13,2,FALSE))","v":"May"},2036,null,null,null,null,null,null,null,null,null,null,null,null,null,null,null,null,null,null,null,null,null,null,null,null,{"$f":"IF(OR(AND(E299=\"Feb\",OR(F299=2020,OR(F299=2024,OR(F299=2028,OR(F299=2032,OR(F299=2036,F299=2040)))))),AND(E299=\"Feb\",OR(F299=2044,OR(F299=2048,F299=2052)))),29,VLOOKUP(E299,Lookup!$B$2:$C$13,2,FALSE))","v":31},0,null,null,15]
[null,null,null,15,{"$f":"IF(E299=\"\",\"\",VLOOKUP(E299,Lookup!$A$2:$B$13,2,FALSE))","v":"Jun"},2036,null,null,null,null,null,null,null,null,null,null,null,null,null,null,null,null,null,null,null,null,null,null,null,null,{"$f":"IF(OR(AND(E300=\"Feb\",OR(F300=2020,OR(F300=2024,OR(F300=2028,OR(F300=2032,OR(F300=2036,F300=2040)))))),AND(E300=\"Feb\",OR(F300=2044,OR(F300=2048,F300=2052)))),29,VLOOKUP(E300,Lookup!$B$2:$C$13,2,FALSE))","v":30},0,null,null,15]
[null,null,null,15,{"$f":"IF(E300=\"\",\"\",VLOOKUP(E300,Lookup!$A$2:$B$13,2,FALSE))","v":"Jul"},2036,null,null,null,null,null,null,null,null,null,null,null,null,null,null,null,null,null,null,null,null,null,null,null,null,{"$f":"IF(OR(AND(E301=\"Feb\",OR(F301=2020,OR(F301=2024,OR(F301=2028,OR(F301=2032,OR(F301=2036,F301=2040)))))),AND(E301=\"Feb\",OR(F301=2044,OR(F301=2048,F301=2052)))),29,VLOOKUP(E301,Lookup!$B$2:$C$13,2,FALSE))","v":31},0,null,null,15]
[null,null,null,15,{"$f":"IF(E301=\"\",\"\",VLOOKUP(E301,Lookup!$A$2:$B$13,2,FALSE))","v":"Aug"},2036,null,null,null,null,null,null,null,null,null,null,null,null,null,null,null,null,null,null,null,null,null,null,null,null,{"$f":"IF(OR(AND(E302=\"Feb\",OR(F302=2020,OR(F302=2024,OR(F302=2028,OR(F302=2032,OR(F302=2036,F302=2040)))))),AND(E302=\"Feb\",OR(F302=2044,OR(F302=2048,F302=2052)))),29,VLOOKUP(E302,Lookup!$B$2:$C$13,2,FALSE))","v":31},0,null,null,15]
[null,null,null,15,{"$f":"IF(E302=\"\",\"\",VLOOKUP(E302,Lookup!$A$2:$B$13,2,FALSE))","v":"Sep"},2036,null,null,null,null,null,null,null,null,null,null,null,null,null,null,null,null,null,null,null,null,null,null,null,null,{"$f":"IF(OR(AND(E303=\"Feb\",OR(F303=2020,OR(F303=2024,OR(F303=2028,OR(F303=2032,OR(F303=2036,F303=2040)))))),AND(E303=\"Feb\",OR(F303=2044,OR(F303=2048,F303=2052)))),29,VLOOKUP(E303,Lookup!$B$2:$C$13,2,FALSE))","v":30},0,null,null,15]
[null,null,null,15,{"$f":"IF(E303=\"\",\"\",VLOOKUP(E303,Lookup!$A$2:$B$13,2,FALSE))","v":"Oct"},2036,null,null,null,null,null,null,null,null,null,null,null,null,null,null,null,null,null,null,null,null,null,null,null,null,{"$f":"IF(OR(AND(E304=\"Feb\",OR(F304=2020,OR(F304=2024,OR(F304=2028,OR(F304=2032,OR(F304=2036,F304=2040)))))),AND(E304=\"Feb\",OR(F304=2044,OR(F304=2048,F304=2052)))),29,VLOOKUP(E304,Lookup!$B$2:$C$13,2,FALSE))","v":31},0,null,null,15]
[null,null,null,15,{"$f":"IF(E304=\"\",\"\",VLOOKUP(E304,Lookup!$A$2:$B$13,2,FALSE))","v":"Nov"},2036,null,null,null,null,null,null,null,null,null,null,null,null,null,null,null,null,null,null,null,null,null,null,null,null,{"$f":"IF(OR(AND(E305=\"Feb\",OR(F305=2020,OR(F305=2024,OR(F305=2028,OR(F305=2032,OR(F305=2036,F305=2040)))))),AND(E305=\"Feb\",OR(F305=2044,OR(F305=2048,F305=2052)))),29,VLOOKUP(E305,Lookup!$B$2:$C$13,2,FALSE))","v":30},0,null,null,15]
[null,null,null,15,{"$f":"IF(E305=\"\",\"\",VLOOKUP(E305,Lookup!$A$2:$B$13,2,FALSE))","v":"Dec"},2036,null,null,null,null,null,null,null,null,null,null,null,null,null,null,null,null,null,null,null,null,null,null,null,null,{"$f":"IF(OR(AND(E306=\"Feb\",OR(F306=2020,OR(F306=2024,OR(F306=2028,OR(F306=2032,OR(F306=2036,F306=2040)))))),AND(E306=\"Feb\",OR(F306=2044,OR(F306=2048,F306=2052)))),29,VLOOKUP(E306,Lookup!$B$2:$C$13,2,FALSE))","v":31},0,null,null,15]
[null,null,null,16,{"$f":"IF(E306=\"\",\"\",VLOOKUP(E306,Lookup!$A$2:$B$13,2,FALSE))","v":"Jan"},2037,null,null,null,null,null,null,null,null,null,null,null,null,null,null,null,null,null,null,null,null,null,null,null,null,{"$f":"IF(OR(AND(E307=\"Feb\",OR(F307=2020,OR(F307=2024,OR(F307=2028,OR(F307=2032,OR(F307=2036,F307=2040)))))),AND(E307=\"Feb\",OR(F307=2044,OR(F307=2048,F307=2052)))),29,VLOOKUP(E307,Lookup!$B$2:$C$13,2,FALSE))","v":31},0,null,null,16]
[null,null,null,16,{"$f":"IF(E307=\"\",\"\",VLOOKUP(E307,Lookup!$A$2:$B$13,2,FALSE))","v":"Feb"},2037,null,null,null,null,null,null,null,null,null,null,null,null,null,null,null,null,null,null,null,null,null,null,null,null,{"$f":"IF(OR(AND(E308=\"Feb\",OR(F308=2020,OR(F308=2024,OR(F308=2028,OR(F308=2032,OR(F308=2036,F308=2040)))))),AND(E308=\"Feb\",OR(F308=2044,OR(F308=2048,F308=2052)))),29,VLOOKUP(E308,Lookup!$B$2:$C$13,2,FALSE))","v":28},0,null,null,16]
[null,null,null,16,{"$f":"IF(E308=\"\",\"\",VLOOKUP(E308,Lookup!$A$2:$B$13,2,FALSE))","v":"Mar"},2037,null,null,null,null,null,null,null,null,null,null,null,null,null,null,null,null,null,null,null,null,null,null,null,null,{"$f":"IF(OR(AND(E309=\"Feb\",OR(F309=2020,OR(F309=2024,OR(F309=2028,OR(F309=2032,OR(F309=2036,F309=2040)))))),AND(E309=\"Feb\",OR(F309=2044,OR(F309=2048,F309=2052)))),29,VLOOKUP(E309,Lookup!$B$2:$C$13,2,FALSE))","v":31},0,null,null,16]
[null,null,null,16,{"$f":"IF(E309=\"\",\"\",VLOOKUP(E309,Lookup!$A$2:$B$13,2,FALSE))","v":"Apr"},2037,null,null,null,null,null,null,null,null,null,null,null,null,null,null,null,null,null,null,null,null,null,null,null,null,{"$f":"IF(OR(AND(E310=\"Feb\",OR(F310=2020,OR(F310=2024,OR(F310=2028,OR(F310=2032,OR(F310=2036,F310=2040)))))),AND(E310=\"Feb\",OR(F310=2044,OR(F310=2048,F310=2052)))),29,VLOOKUP(E310,Lookup!$B$2:$C$13,2,FALSE))","v":30},0,null,null,16]
[null,null,null,16,{"$f":"IF(E310=\"\",\"\",VLOOKUP(E310,Lookup!$A$2:$B$13,2,FALSE))","v":"May"},2037,null,null,null,null,null,null,null,null,null,null,null,null,null,null,null,null,null,null,null,null,null,null,null,null,{"$f":"IF(OR(AND(E311=\"Feb\",OR(F311=2020,OR(F311=2024,OR(F311=2028,OR(F311=2032,OR(F311=2036,F311=2040)))))),AND(E311=\"Feb\",OR(F311=2044,OR(F311=2048,F311=2052)))),29,VLOOKUP(E311,Lookup!$B$2:$C$13,2,FALSE))","v":31},0,null,null,16]
[null,null,null,16,{"$f":"IF(E311=\"\",\"\",VLOOKUP(E311,Lookup!$A$2:$B$13,2,FALSE))","v":"Jun"},2037,null,null,null,null,null,null,null,null,null,null,null,null,null,null,null,null,null,null,null,null,null,null,null,null,{"$f":"IF(OR(AND(E312=\"Feb\",OR(F312=2020,OR(F312=2024,OR(F312=2028,OR(F312=2032,OR(F312=2036,F312=2040)))))),AND(E312=\"Feb\",OR(F312=2044,OR(F312=2048,F312=2052)))),29,VLOOKUP(E312,Lookup!$B$2:$C$13,2,FALSE))","v":30},0,null,null,16]
[null,null,null,16,{"$f":"IF(E312=\"\",\"\",VLOOKUP(E312,Lookup!$A$2:$B$13,2,FALSE))","v":"Jul"},2037,null,null,null,null,null,null,null,null,null,null,null,null,null,null,null,null,null,null,null,null,null,null,null,null,{"$f":"IF(OR(AND(E313=\"Feb\",OR(F313=2020,OR(F313=2024,OR(F313=2028,OR(F313=2032,OR(F313=2036,F313=2040)))))),AND(E313=\"Feb\",OR(F313=2044,OR(F313=2048,F313=2052)))),29,VLOOKUP(E313,Lookup!$B$2:$C$13,2,FALSE))","v":31},0,null,null,16]
[null,null,null,16,{"$f":"IF(E313=\"\",\"\",VLOOKUP(E313,Lookup!$A$2:$B$13,2,FALSE))","v":"Aug"},2037,null,null,null,null,null,null,null,null,null,null,null,null,null,null,null,null,null,null,null,null,null,null,null,null,{"$f":"IF(OR(AND(E314=\"Feb\",OR(F314=2020,OR(F314=2024,OR(F314=2028,OR(F314=2032,OR(F314=2036,F314=2040)))))),AND(E314=\"Feb\",OR(F314=2044,OR(F314=2048,F314=2052)))),29,VLOOKUP(E314,Lookup!$B$2:$C$13,2,FALSE))","v":31},0,null,null,16]
[null,null,null,16,{"$f":"IF(E314=\"\",\"\",VLOOKUP(E314,Lookup!$A$2:$B$13,2,FALSE))","v":"Sep"},2037,null,null,null,null,null,null,null,null,null,null,null,null,null,null,null,null,null,null,null,null,null,null,null,null,{"$f":"IF(OR(AND(E315=\"Feb\",OR(F315=2020,OR(F315=2024,OR(F315=2028,OR(F315=2032,OR(F315=2036,F315=2040)))))),AND(E315=\"Feb\",OR(F315=2044,OR(F315=2048,F315=2052)))),29,VLOOKUP(E315,Lookup!$B$2:$C$13,2,FALSE))","v":30},0,null,null,16]
[null,null,null,16,{"$f":"IF(E315=\"\",\"\",VLOOKUP(E315,Lookup!$A$2:$B$13,2,FALSE))","v":"Oct"},2037,null,null,null,null,null,null,null,null,null,null,null,null,null,null,null,null,null,null,null,null,null,null,null,null,{"$f":"IF(OR(AND(E316=\"Feb\",OR(F316=2020,OR(F316=2024,OR(F316=2028,OR(F316=2032,OR(F316=2036,F316=2040)))))),AND(E316=\"Feb\",OR(F316=2044,OR(F316=2048,F316=2052)))),29,VLOOKUP(E316,Lookup!$B$2:$C$13,2,FALSE))","v":31},0,null,null,16]
[null,null,null,16,{"$f":"IF(E316=\"\",\"\",VLOOKUP(E316,Lookup!$A$2:$B$13,2,FALSE))","v":"Nov"},2037,null,null,null,null,null,null,null,null,null,null,null,null,null,null,null,null,null,null,null,null,null,null,null,null,{"$f":"IF(OR(AND(E317=\"Feb\",OR(F317=2020,OR(F317=2024,OR(F317=2028,OR(F317=2032,OR(F317=2036,F317=2040)))))),AND(E317=\"Feb\",OR(F317=2044,OR(F317=2048,F317=2052)))),29,VLOOKUP(E317,Lookup!$B$2:$C$13,2,FALSE))","v":30},0,null,null,16]
[null,null,null,16,{"$f":"IF(E317=\"\",\"\",VLOOKUP(E317,Lookup!$A$2:$B$13,2,FALSE))","v":"Dec"},2037,null,null,null,null,null,null,null,null,null,null,null,null,null,null,null,null,null,null,null,null,null,null,null,null,{"$f":"IF(OR(AND(E318=\"Feb\",OR(F318=2020,OR(F318=2024,OR(F318=2028,OR(F318=2032,OR(F318=2036,F318=2040)))))),AND(E318=\"Feb\",OR(F318=2044,OR(F318=2048,F318=2052)))),29,VLOOKUP(E318,Lookup!$B$2:$C$13,2,FALSE))","v":31},0,null,null,16]
[null,null,null,17,{"$f":"IF(E318=\"\",\"\",VLOOKUP(E318,Lookup!$A$2:$B$13,2,FALSE))","v":"Jan"},2038,null,null,null,null,null,null,null,null,null,null,null,null,null,null,null,null,null,null,null,null,null,null,null,null,{"$f":"IF(OR(AND(E319=\"Feb\",OR(F319=2020,OR(F319=2024,OR(F319=2028,OR(F319=2032,OR(F319=2036,F319=2040)))))),AND(E319=\"Feb\",OR(F319=2044,OR(F319=2048,F319=2052)))),29,VLOOKUP(E319,Lookup!$B$2:$C$13,2,FALSE))","v":31},{"$f":"SUM(G319:AD319)*AE319","v":0},null,null,{"$f":"+D319","v":17}]
[null,null,null,17,{"$f":"IF(E319=\"\",\"\",VLOOKUP(E319,Lookup!$A$2:$B$13,2,FALSE))","v":"Feb"},2038,null,null,null,null,null,null,null,null,null,null,null,null,null,null,null,null,null,null,null,null,null,null,null,null,{"$f":"IF(OR(AND(E320=\"Feb\",OR(F320=2020,OR(F320=2024,OR(F320=2028,OR(F320=2032,OR(F320=2036,F320=2040)))))),AND(E320=\"Feb\",OR(F320=2044,OR(F320=2048,F320=2052)))),29,VLOOKUP(E320,Lookup!$B$2:$C$13,2,FALSE))","v":28},0,null,null,17]
[null,null,null,17,{"$f":"IF(E320=\"\",\"\",VLOOKUP(E320,Lookup!$A$2:$B$13,2,FALSE))","v":"Mar"},2038,null,null,null,null,null,null,null,null,null,null,null,null,null,null,null,null,null,null,null,null,null,null,null,null,{"$f":"IF(OR(AND(E321=\"Feb\",OR(F321=2020,OR(F321=2024,OR(F321=2028,OR(F321=2032,OR(F321=2036,F321=2040)))))),AND(E321=\"Feb\",OR(F321=2044,OR(F321=2048,F321=2052)))),29,VLOOKUP(E321,Lookup!$B$2:$C$13,2,FALSE))","v":31},0,null,null,17]
[null,null,null,17,{"$f":"IF(E321=\"\",\"\",VLOOKUP(E321,Lookup!$A$2:$B$13,2,FALSE))","v":"Apr"},2038,null,null,null,null,null,null,null,null,null,null,null,null,null,null,null,null,null,null,null,null,null,null,null,null,{"$f":"IF(OR(AND(E322=\"Feb\",OR(F322=2020,OR(F322=2024,OR(F322=2028,OR(F322=2032,OR(F322=2036,F322=2040)))))),AND(E322=\"Feb\",OR(F322=2044,OR(F322=2048,F322=2052)))),29,VLOOKUP(E322,Lookup!$B$2:$C$13,2,FALSE))","v":30},0,null,null,17]
[null,null,null,17,{"$f":"IF(E322=\"\",\"\",VLOOKUP(E322,Lookup!$A$2:$B$13,2,FALSE))","v":"May"},2038,null,null,null,null,null,null,null,null,null,null,null,null,null,null,null,null,null,null,null,null,null,null,null,null,{"$f":"IF(OR(AND(E323=\"Feb\",OR(F323=2020,OR(F323=2024,OR(F323=2028,OR(F323=2032,OR(F323=2036,F323=2040)))))),AND(E323=\"Feb\",OR(F323=2044,OR(F323=2048,F323=2052)))),29,VLOOKUP(E323,Lookup!$B$2:$C$13,2,FALSE))","v":31},0,null,null,17]
[null,null,null,17,{"$f":"IF(E323=\"\",\"\",VLOOKUP(E323,Lookup!$A$2:$B$13,2,FALSE))","v":"Jun"},2038,null,null,null,null,null,null,null,null,null,null,null,null,null,null,null,null,null,null,null,null,null,null,null,null,{"$f":"IF(OR(AND(E324=\"Feb\",OR(F324=2020,OR(F324=2024,OR(F324=2028,OR(F324=2032,OR(F324=2036,F324=2040)))))),AND(E324=\"Feb\",OR(F324=2044,OR(F324=2048,F324=2052)))),29,VLOOKUP(E324,Lookup!$B$2:$C$13,2,FALSE))","v":30},0,null,null,17]
[null,null,null,17,{"$f":"IF(E324=\"\",\"\",VLOOKUP(E324,Lookup!$A$2:$B$13,2,FALSE))","v":"Jul"},2038,null,null,null,null,null,null,null,null,null,null,null,null,null,null,null,null,null,null,null,null,null,null,null,null,{"$f":"IF(OR(AND(E325=\"Feb\",OR(F325=2020,OR(F325=2024,OR(F325=2028,OR(F325=2032,OR(F325=2036,F325=2040)))))),AND(E325=\"Feb\",OR(F325=2044,OR(F325=2048,F325=2052)))),29,VLOOKUP(E325,Lookup!$B$2:$C$13,2,FALSE))","v":31},0,null,null,17]
[null,null,null,17,{"$f":"IF(E325=\"\",\"\",VLOOKUP(E325,Lookup!$A$2:$B$13,2,FALSE))","v":"Aug"},2038,null,null,null,null,null,null,null,null,null,null,null,null,null,null,null,null,null,null,null,null,null,null,null,null,{"$f":"IF(OR(AND(E326=\"Feb\",OR(F326=2020,OR(F326=2024,OR(F326=2028,OR(F326=2032,OR(F326=2036,F326=2040)))))),AND(E326=\"Feb\",OR(F326=2044,OR(F326=2048,F326=2052)))),29,VLOOKUP(E326,Lookup!$B$2:$C$13,2,FALSE))","v":31},0,null,null,17]
[null,null,null,17,{"$f":"IF(E326=\"\",\"\",VLOOKUP(E326,Lookup!$A$2:$B$13,2,FALSE))","v":"Sep"},2038,null,null,null,null,null,null,null,null,null,null,null,null,null,null,null,null,null,null,null,null,null,null,null,null,{"$f":"IF(OR(AND(E327=\"Feb\",OR(F327=2020,OR(F327=2024,OR(F327=2028,OR(F327=2032,OR(F327=2036,F327=2040)))))),AND(E327=\"Feb\",OR(F327=2044,OR(F327=2048,F327=2052)))),29,VLOOKUP(E327,Lookup!$B$2:$C$13,2,FALSE))","v":30},0,null,null,17]
[null,null,null,17,{"$f":"IF(E327=\"\",\"\",VLOOKUP(E327,Lookup!$A$2:$B$13,2,FALSE))","v":"Oct"},2038,null,null,null,null,null,null,null,null,null,null,null,null,null,null,null,null,null,null,null,null,null,null,null,null,{"$f":"IF(OR(AND(E328=\"Feb\",OR(F328=2020,OR(F328=2024,OR(F328=2028,OR(F328=2032,OR(F328=2036,F328=2040)))))),AND(E328=\"Feb\",OR(F328=2044,OR(F328=2048,F328=2052)))),29,VLOOKUP(E328,Lookup!$B$2:$C$13,2,FALSE))","v":31},0,null,null,17]
[null,null,null,17,{"$f":"IF(E328=\"\",\"\",VLOOKUP(E328,Lookup!$A$2:$B$13,2,FALSE))","v":"Nov"},2038,null,null,null,null,null,null,null,null,null,null,null,null,null,null,null,null,null,null,null,null,null,null,null,null,{"$f":"IF(OR(AND(E329=\"Feb\",OR(F329=2020,OR(F329=2024,OR(F329=2028,OR(F329=2032,OR(F329=2036,F329=2040)))))),AND(E329=\"Feb\",OR(F329=2044,OR(F329=2048,F329=2052)))),29,VLOOKUP(E329,Lookup!$B$2:$C$13,2,FALSE))","v":30},0,null,null,17]
[null,null,null,17,{"$f":"IF(E329=\"\",\"\",VLOOKUP(E329,Lookup!$A$2:$B$13,2,FALSE))","v":"Dec"},2038,null,null,null,null,null,null,null,null,null,null,null,null,null,null,null,null,null,null,null,null,null,null,null,null,{"$f":"IF(OR(AND(E330=\"Feb\",OR(F330=2020,OR(F330=2024,OR(F330=2028,OR(F330=2032,OR(F330=2036,F330=2040)))))),AND(E330=\"Feb\",OR(F330=2044,OR(F330=2048,F330=2052)))),29,VLOOKUP(E330,Lookup!$B$2:$C$13,2,FALSE))","v":31},0,null,null,17]
[null,null,null,18,{"$f":"IF(E330=\"\",\"\",VLOOKUP(E330,Lookup!$A$2:$B$13,2,FALSE))","v":"Jan"},2039,null,null,null,null,null,null,null,null,null,null,null,null,null,null,null,null,null,null,null,null,null,null,null,null,{"$f":"IF(OR(AND(E331=\"Feb\",OR(F331=2020,OR(F331=2024,OR(F331=2028,OR(F331=2032,OR(F331=2036,F331=2040)))))),AND(E331=\"Feb\",OR(F331=2044,OR(F331=2048,F331=2052)))),29,VLOOKUP(E331,Lookup!$B$2:$C$13,2,FALSE))","v":31},0,null,null,18]
[null,null,null,{"$f":"+D320+1","v":18},{"$f":"IF(E331=\"\",\"\",VLOOKUP(E331,Lookup!$A$2:$B$13,2,FALSE))","v":"Feb"},{"$f":"IF(E331=0,\"\",IF(E331=\"Dec\",F331+1,F331))","v":2039},null,null,null,null,null,null,null,null,null,null,null,null,null,null,null,null,null,null,null,null,null,null,null,null,{"$f":"IF(OR(AND(E332=\"Feb\",OR(F332=2020,OR(F332=2024,OR(F332=2028,OR(F332=2032,OR(F332=2036,F332=2040)))))),AND(E332=\"Feb\",OR(F332=2044,OR(F332=2048,F332=2052)))),29,VLOOKUP(E332,Lookup!$B$2:$C$13,2,FALSE))","v":28},0,null,null,18]
[null,null,null,18,{"$f":"IF(E332=\"\",\"\",VLOOKUP(E332,Lookup!$A$2:$B$13,2,FALSE))","v":"Mar"},2039,null,null,null,null,null,null,null,null,null,null,null,null,null,null,null,null,null,null,null,null,null,null,null,null,{"$f":"IF(OR(AND(E333=\"Feb\",OR(F333=2020,OR(F333=2024,OR(F333=2028,OR(F333=2032,OR(F333=2036,F333=2040)))))),AND(E333=\"Feb\",OR(F333=2044,OR(F333=2048,F333=2052)))),29,VLOOKUP(E333,Lookup!$B$2:$C$13,2,FALSE))","v":31},0,null,null,18]
[null,null,null,18,{"$f":"IF(E333=\"\",\"\",VLOOKUP(E333,Lookup!$A$2:$B$13,2,FALSE))","v":"Apr"},2039,null,null,null,null,null,null,null,null,null,null,null,null,null,null,null,null,null,null,null,null,null,null,null,null,{"$f":"IF(OR(AND(E334=\"Feb\",OR(F334=2020,OR(F334=2024,OR(F334=2028,OR(F334=2032,OR(F334=2036,F334=2040)))))),AND(E334=\"Feb\",OR(F334=2044,OR(F334=2048,F334=2052)))),29,VLOOKUP(E334,Lookup!$B$2:$C$13,2,FALSE))","v":30},0,null,null,18]
[null,null,null,18,{"$f":"IF(E334=\"\",\"\",VLOOKUP(E334,Lookup!$A$2:$B$13,2,FALSE))","v":"May"},2039,null,null,null,null,null,null,null,null,null,null,null,null,null,null,null,null,null,null,null,null,null,null,null,null,{"$f":"IF(OR(AND(E335=\"Feb\",OR(F335=2020,OR(F335=2024,OR(F335=2028,OR(F335=2032,OR(F335=2036,F335=2040)))))),AND(E335=\"Feb\",OR(F335=2044,OR(F335=2048,F335=2052)))),29,VLOOKUP(E335,Lookup!$B$2:$C$13,2,FALSE))","v":31},0,null,null,18]
[null,null,null,18,{"$f":"IF(E335=\"\",\"\",VLOOKUP(E335,Lookup!$A$2:$B$13,2,FALSE))","v":"Jun"},2039,null,null,null,null,null,null,null,null,null,null,null,null,null,null,null,null,null,null,null,null,null,null,null,null,{"$f":"IF(OR(AND(E336=\"Feb\",OR(F336=2020,OR(F336=2024,OR(F336=2028,OR(F336=2032,OR(F336=2036,F336=2040)))))),AND(E336=\"Feb\",OR(F336=2044,OR(F336=2048,F336=2052)))),29,VLOOKUP(E336,Lookup!$B$2:$C$13,2,FALSE))","v":30},0,null,null,{"$f":"+D336","v":18}]
[null,null,null,18,{"$f":"IF(E336=\"\",\"\",VLOOKUP(E336,Lookup!$A$2:$B$13,2,FALSE))","v":"Jul"},2039,null,null,null,null,null,null,null,null,null,null,null,null,null,null,null,null,null,null,null,null,null,null,null,null,{"$f":"IF(OR(AND(E337=\"Feb\",OR(F337=2020,OR(F337=2024,OR(F337=2028,OR(F337=2032,OR(F337=2036,F337=2040)))))),AND(E337=\"Feb\",OR(F337=2044,OR(F337=2048,F337=2052)))),29,VLOOKUP(E337,Lookup!$B$2:$C$13,2,FALSE))","v":31},0,null,null,18]
[null,null,null,18,{"$f":"IF(E337=\"\",\"\",VLOOKUP(E337,Lookup!$A$2:$B$13,2,FALSE))","v":"Aug"},2039,null,null,null,null,null,null,null,null,null,null,null,null,null,null,null,null,null,null,null,null,null,null,null,null,{"$f":"IF(OR(AND(E338=\"Feb\",OR(F338=2020,OR(F338=2024,OR(F338=2028,OR(F338=2032,OR(F338=2036,F338=2040)))))),AND(E338=\"Feb\",OR(F338=2044,OR(F338=2048,F338=2052)))),29,VLOOKUP(E338,Lookup!$B$2:$C$13,2,FALSE))","v":31},0,null,null,18]
[null,null,null,18,{"$f":"IF(E338=\"\",\"\",VLOOKUP(E338,Lookup!$A$2:$B$13,2,FALSE))","v":"Sep"},2039,null,null,null,null,null,null,null,null,null,null,null,null,null,null,null,null,null,null,null,null,null,null,null,null,{"$f":"IF(OR(AND(E339=\"Feb\",OR(F339=2020,OR(F339=2024,OR(F339=2028,OR(F339=2032,OR(F339=2036,F339=2040)))))),AND(E339=\"Feb\",OR(F339=2044,OR(F339=2048,F339=2052)))),29,VLOOKUP(E339,Lookup!$B$2:$C$13,2,FALSE))","v":30},0,null,null,18]
[null,null,null,18,{"$f":"IF(E339=\"\",\"\",VLOOKUP(E339,Lookup!$A$2:$B$13,2,FALSE))","v":"Oct"},2039,null,null,null,null,null,null,null,null,null,null,null,null,null,null,null,null,null,null,null,null,null,null,null,null,{"$f":"IF(OR(AND(E340=\"Feb\",OR(F340=2020,OR(F340=2024,OR(F340=2028,OR(F340=2032,OR(F340=2036,F340=2040)))))),AND(E340=\"Feb\",OR(F340=2044,OR(F340=2048,F340=2052)))),29,VLOOKUP(E340,Lookup!$B$2:$C$13,2,FALSE))","v":31},0,null,null,18]
[null,null,null,18,{"$f":"IF(E340=\"\",\"\",VLOOKUP(E340,Lookup!$A$2:$B$13,2,FALSE))","v":"Nov"},2039,null,null,null,null,null,null,null,null,null,null,null,null,null,null,null,null,null,null,null,null,null,null,null,null,{"$f":"IF(OR(AND(E341=\"Feb\",OR(F341=2020,OR(F341=2024,OR(F341=2028,OR(F341=2032,OR(F341=2036,F341=2040)))))),AND(E341=\"Feb\",OR(F341=2044,OR(F341=2048,F341=2052)))),29,VLOOKUP(E341,Lookup!$B$2:$C$13,2,FALSE))","v":30},0,null,null,18]
[null,null,null,18,{"$f":"IF(E341=\"\",\"\",VLOOKUP(E341,Lookup!$A$2:$B$13,2,FALSE))","v":"Dec"},2039,null,null,null,null,null,null,null,null,null,null,null,null,null,null,null,null,null,null,null,null,null,null,null,null,{"$f":"IF(OR(AND(E342=\"Feb\",OR(F342=2020,OR(F342=2024,OR(F342=2028,OR(F342=2032,OR(F342=2036,F342=2040)))))),AND(E342=\"Feb\",OR(F342=2044,OR(F342=2048,F342=2052)))),29,VLOOKUP(E342,Lookup!$B$2:$C$13,2,FALSE))","v":31},0,null,null,18]
[null,null,null,19,{"$f":"IF(E342=\"\",\"\",VLOOKUP(E342,Lookup!$A$2:$B$13,2,FALSE))","v":"Jan"},2040,null,null,null,null,null,null,null,null,null,null,null,null,null,null,null,null,null,null,null,null,null,null,null,null,{"$f":"IF(OR(AND(E343=\"Feb\",OR(F343=2020,OR(F343=2024,OR(F343=2028,OR(F343=2032,OR(F343=2036,F343=2040)))))),AND(E343=\"Feb\",OR(F343=2044,OR(F343=2048,F343=2052)))),29,VLOOKUP(E343,Lookup!$B$2:$C$13,2,FALSE))","v":31},0,null,null,19]
[null,null,null,19,{"$f":"IF(E343=\"\",\"\",VLOOKUP(E343,Lookup!$A$2:$B$13,2,FALSE))","v":"Feb"},2040,null,null,null,null,null,null,null,null,null,null,null,null,null,null,null,null,null,null,null,null,null,null,null,null,{"$f":"IF(OR(AND(E344=\"Feb\",OR(F344=2020,OR(F344=2024,OR(F344=2028,OR(F344=2032,OR(F344=2036,F344=2040)))))),AND(E344=\"Feb\",OR(F344=2044,OR(F344=2048,F344=2052)))),29,VLOOKUP(E344,Lookup!$B$2:$C$13,2,FALSE))","v":29},0,null,null,{"$f":"+D344","v":19}]
[null,null,null,19,{"$f":"IF(E344=\"\",\"\",VLOOKUP(E344,Lookup!$A$2:$B$13,2,FALSE))","v":"Mar"},2040,null,null,null,null,null,null,null,null,null,null,null,null,null,null,null,null,null,null,null,null,null,null,null,null,{"$f":"IF(OR(AND(E345=\"Feb\",OR(F345=2020,OR(F345=2024,OR(F345=2028,OR(F345=2032,OR(F345=2036,F345=2040)))))),AND(E345=\"Feb\",OR(F345=2044,OR(F345=2048,F345=2052)))),29,VLOOKUP(E345,Lookup!$B$2:$C$13,2,FALSE))","v":31},0,null,null,19]
[null,null,null,19,{"$f":"IF(E345=\"\",\"\",VLOOKUP(E345,Lookup!$A$2:$B$13,2,FALSE))","v":"Apr"},2040,null,null,null,null,null,null,null,null,null,null,null,null,null,null,null,null,null,null,null,null,null,null,null,null,{"$f":"IF(OR(AND(E346=\"Feb\",OR(F346=2020,OR(F346=2024,OR(F346=2028,OR(F346=2032,OR(F346=2036,F346=2040)))))),AND(E346=\"Feb\",OR(F346=2044,OR(F346=2048,F346=2052)))),29,VLOOKUP(E346,Lookup!$B$2:$C$13,2,FALSE))","v":30},0,null,null,19]
[null,null,null,19,{"$f":"IF(E346=\"\",\"\",VLOOKUP(E346,Lookup!$A$2:$B$13,2,FALSE))","v":"May"},2040,null,null,null,null,null,null,null,null,null,null,null,null,null,null,null,null,null,null,null,null,null,null,null,null,{"$f":"IF(OR(AND(E347=\"Feb\",OR(F347=2020,OR(F347=2024,OR(F347=2028,OR(F347=2032,OR(F347=2036,F347=2040)))))),AND(E347=\"Feb\",OR(F347=2044,OR(F347=2048,F347=2052)))),29,VLOOKUP(E347,Lookup!$B$2:$C$13,2,FALSE))","v":31},0,null,null,19]
[null,null,null,19,{"$f":"IF(E347=\"\",\"\",VLOOKUP(E347,Lookup!$A$2:$B$13,2,FALSE))","v":"Jun"},2040,null,null,null,null,null,null,null,null,null,null,null,null,null,null,null,null,null,null,null,null,null,null,null,null,{"$f":"IF(OR(AND(E348=\"Feb\",OR(F348=2020,OR(F348=2024,OR(F348=2028,OR(F348=2032,OR(F348=2036,F348=2040)))))),AND(E348=\"Feb\",OR(F348=2044,OR(F348=2048,F348=2052)))),29,VLOOKUP(E348,Lookup!$B$2:$C$13,2,FALSE))","v":30},0,null,null,19]
[null,null,null,19,{"$f":"IF(E348=\"\",\"\",VLOOKUP(E348,Lookup!$A$2:$B$13,2,FALSE))","v":"Jul"},2040,null,null,null,null,null,null,null,null,null,null,null,null,null,null,null,null,null,null,null,null,null,null,null,null,{"$f":"IF(OR(AND(E349=\"Feb\",OR(F349=2020,OR(F349=2024,OR(F349=2028,OR(F349=2032,OR(F349=2036,F349=2040)))))),AND(E349=\"Feb\",OR(F349=2044,OR(F349=2048,F349=2052)))),29,VLOOKUP(E349,Lookup!$B$2:$C$13,2,FALSE))","v":31},0,null,null,19]
[null,null,null,19,{"$f":"IF(E349=\"\",\"\",VLOOKUP(E349,Lookup!$A$2:$B$13,2,FALSE))","v":"Aug"},2040,null,null,null,null,null,null,null,null,null,null,null,null,null,null,null,null,null,null,null,null,null,null,null,null,{"$f":"IF(OR(AND(E350=\"Feb\",OR(F350=2020,OR(F350=2024,OR(F350=2028,OR(F350=2032,OR(F350=2036,F350=2040)))))),AND(E350=\"Feb\",OR(F350=2044,OR(F350=2048,F350=2052)))),29,VLOOKUP(E350,Lookup!$B$2:$C$13,2,FALSE))","v":31},0,null,null,19]
[null,null,null,19,{"$f":"IF(E350=\"\",\"\",VLOOKUP(E350,Lookup!$A$2:$B$13,2,FALSE))","v":"Sep"},2040,null,null,null,null,null,null,null,null,null,null,null,null,null,null,null,null,null,null,null,null,null,null,null,null,{"$f":"IF(OR(AND(E351=\"Feb\",OR(F351=2020,OR(F351=2024,OR(F351=2028,OR(F351=2032,OR(F351=2036,F351=2040)))))),AND(E351=\"Feb\",OR(F351=2044,OR(F351=2048,F351=2052)))),29,VLOOKUP(E351,Lookup!$B$2:$C$13,2,FALSE))","v":30},0,null,null,19]
[null,null,null,19,{"$f":"IF(E351=\"\",\"\",VLOOKUP(E351,Lookup!$A$2:$B$13,2,FALSE))","v":"Oct"},2040,null,null,null,null,null,null,null,null,null,null,null,null,null,null,null,null,null,null,null,null,null,null,null,null,{"$f":"IF(OR(AND(E352=\"Feb\",OR(F352=2020,OR(F352=2024,OR(F352=2028,OR(F352=2032,OR(F352=2036,F352=2040)))))),AND(E352=\"Feb\",OR(F352=2044,OR(F352=2048,F352=2052)))),29,VLOOKUP(E352,Lookup!$B$2:$C$13,2,FALSE))","v":31},0,null,null,19]
[null,null,null,19,{"$f":"IF(E352=\"\",\"\",VLOOKUP(E352,Lookup!$A$2:$B$13,2,FALSE))","v":"Nov"},2040,null,null,null,null,null,null,null,null,null,null,null,null,null,null,null,null,null,null,null,null,null,null,null,null,{"$f":"IF(OR(AND(E353=\"Feb\",OR(F353=2020,OR(F353=2024,OR(F353=2028,OR(F353=2032,OR(F353=2036,F353=2040)))))),AND(E353=\"Feb\",OR(F353=2044,OR(F353=2048,F353=2052)))),29,VLOOKUP(E353,Lookup!$B$2:$C$13,2,FALSE))","v":30},0,null,null,19]
[null,null,null,19,{"$f":"IF(E353=\"\",\"\",VLOOKUP(E353,Lookup!$A$2:$B$13,2,FALSE))","v":"Dec"},2040,null,null,null,null,null,null,null,null,null,null,null,null,null,null,null,null,null,null,null,null,null,null,null,null,{"$f":"IF(OR(AND(E354=\"Feb\",OR(F354=2020,OR(F354=2024,OR(F354=2028,OR(F354=2032,OR(F354=2036,F354=2040)))))),AND(E354=\"Feb\",OR(F354=2044,OR(F354=2048,F354=2052)))),29,VLOOKUP(E354,Lookup!$B$2:$C$13,2,FALSE))","v":31},0,null,null,19]
[null,null,null,20,{"$f":"IF(E354=\"\",\"\",VLOOKUP(E354,Lookup!$A$2:$B$13,2,FALSE))","v":"Jan"},2041,null,null,null,null,null,null,null,null,null,null,null,null,null,null,null,null,null,null,null,null,null,null,null,null,{"$f":"IF(OR(AND(E355=\"Feb\",OR(F355=2020,OR(F355=2024,OR(F355=2028,OR(F355=2032,OR(F355=2036,F355=2040)))))),AND(E355=\"Feb\",OR(F355=2044,OR(F355=2048,F355=2052)))),29,VLOOKUP(E355,Lookup!$B$2:$C$13,2,FALSE))","v":31},0,null,null,20]
[null,null,null,20,{"$f":"IF(E355=\"\",\"\",VLOOKUP(E355,Lookup!$A$2:$B$13,2,FALSE))","v":"Feb"},{"$f":"IF(E355=0,\"\",IF(E355=\"Dec\",F355+1,F355))","v":2041},null,null,null,null,null,null,null,null,null,null,null,null,null,null,null,null,null,null,null,null,null,null,null,null,{"$f":"IF(OR(AND(E356=\"Feb\",OR(F356=2020,OR(F356=2024,OR(F356=2028,OR(F356=2032,OR(F356=2036,F356=2040)))))),AND(E356=\"Feb\",OR(F356=2044,OR(F356=2048,F356=2052)))),29,VLOOKUP(E356,Lookup!$B$2:$C$13,2,FALSE))","v":28},0,null,null,20]
[null,null,null,20,{"$f":"IF(E356=\"\",\"\",VLOOKUP(E356,Lookup!$A$2:$B$13,2,FALSE))","v":"Mar"},2041,null,null,null,null,null,null,null,null,null,null,null,null,null,null,null,null,null,null,null,null,null,null,null,null,{"$f":"IF(OR(AND(E357=\"Feb\",OR(F357=2020,OR(F357=2024,OR(F357=2028,OR(F357=2032,OR(F357=2036,F357=2040)))))),AND(E357=\"Feb\",OR(F357=2044,OR(F357=2048,F357=2052)))),29,VLOOKUP(E357,Lookup!$B$2:$C$13,2,FALSE))","v":31},0,null,null,20]
[null,null,null,20,{"$f":"IF(E357=\"\",\"\",VLOOKUP(E357,Lookup!$A$2:$B$13,2,FALSE))","v":"Apr"},2041,null,null,null,null,null,null,null,null,null,null,null,null,null,null,null,null,null,null,null,null,null,null,null,null,{"$f":"IF(OR(AND(E358=\"Feb\",OR(F358=2020,OR(F358=2024,OR(F358=2028,OR(F358=2032,OR(F358=2036,F358=2040)))))),AND(E358=\"Feb\",OR(F358=2044,OR(F358=2048,F358=2052)))),29,VLOOKUP(E358,Lookup!$B$2:$C$13,2,FALSE))","v":30},0,null,null,20]
[null,null,null,20,{"$f":"IF(E358=\"\",\"\",VLOOKUP(E358,Lookup!$A$2:$B$13,2,FALSE))","v":"May"},2041,null,null,null,null,null,null,null,null,null,null,null,null,null,null,null,null,null,null,null,null,null,null,null,null,{"$f":"IF(OR(AND(E359=\"Feb\",OR(F359=2020,OR(F359=2024,OR(F359=2028,OR(F359=2032,OR(F359=2036,F359=2040)))))),AND(E359=\"Feb\",OR(F359=2044,OR(F359=2048,F359=2052)))),29,VLOOKUP(E359,Lookup!$B$2:$C$13,2,FALSE))","v":31},0,null,null,20]
[null,null,null,20,{"$f":"IF(E359=\"\",\"\",VLOOKUP(E359,Lookup!$A$2:$B$13,2,FALSE))","v":"Jun"},2041,null,null,null,null,null,null,null,null,null,null,null,null,null,null,null,null,null,null,null,null,null,null,null,null,{"$f":"IF(OR(AND(E360=\"Feb\",OR(F360=2020,OR(F360=2024,OR(F360=2028,OR(F360=2032,OR(F360=2036,F360=2040)))))),AND(E360=\"Feb\",OR(F360=2044,OR(F360=2048,F360=2052)))),29,VLOOKUP(E360,Lookup!$B$2:$C$13,2,FALSE))","v":30},0,null,null,20]
[null,null,null,20,{"$f":"IF(E360=\"\",\"\",VLOOKUP(E360,Lookup!$A$2:$B$13,2,FALSE))","v":"Jul"},2041,null,null,null,null,null,null,null,null,null,null,null,null,null,null,null,null,null,null,null,null,null,null,null,null,{"$f":"IF(OR(AND(E361=\"Feb\",OR(F361=2020,OR(F361=2024,OR(F361=2028,OR(F361=2032,OR(F361=2036,F361=2040)))))),AND(E361=\"Feb\",OR(F361=2044,OR(F361=2048,F361=2052)))),29,VLOOKUP(E361,Lookup!$B$2:$C$13,2,FALSE))","v":31},0,null,null,20]
[null,null,null,20,{"$f":"IF(E361=\"\",\"\",VLOOKUP(E361,Lookup!$A$2:$B$13,2,FALSE))","v":"Aug"},2041,null,null,null,null,null,null,null,null,null,null,null,null,null,null,null,null,null,null,null,null,null,null,null,null,{"$f":"IF(OR(AND(E362=\"Feb\",OR(F362=2020,OR(F362=2024,OR(F362=2028,OR(F362=2032,OR(F362=2036,F362=2040)))))),AND(E362=\"Feb\",OR(F362=2044,OR(F362=2048,F362=2052)))),29,VLOOKUP(E362,Lookup!$B$2:$C$13,2,FALSE))","v":31},0,null,null,20]
[null,null,null,20,{"$f":"IF(E362=\"\",\"\",VLOOKUP(E362,Lookup!$A$2:$B$13,2,FALSE))","v":"Sep"},2041,null,null,null,null,null,null,null,null,null,null,null,null,null,null,null,null,null,null,null,null,null,null,null,null,{"$f":"IF(OR(AND(E363=\"Feb\",OR(F363=2020,OR(F363=2024,OR(F363=2028,OR(F363=2032,OR(F363=2036,F363=2040)))))),AND(E363=\"Feb\",OR(F363=2044,OR(F363=2048,F363=2052)))),29,VLOOKUP(E363,Lookup!$B$2:$C$13,2,FALSE))","v":30},0,null,null,20]
[null,null,null,20,{"$f":"IF(E363=\"\",\"\",VLOOKUP(E363,Lookup!$A$2:$B$13,2,FALSE))","v":"Oct"},2041,null,null,null,null,null,null,null,null,null,null,null,null,null,null,null,null,null,null,null,null,null,null,null,null,{"$f":"IF(OR(AND(E364=\"Feb\",OR(F364=2020,OR(F364=2024,OR(F364=2028,OR(F364=2032,OR(F364=2036,F364=2040)))))),AND(E364=\"Feb\",OR(F364=2044,OR(F364=2048,F364=2052)))),29,VLOOKUP(E364,Lookup!$B$2:$C$13,2,FALSE))","v":31},0,null,null,20]
[null,null,null,20,{"$f":"IF(E364=\"\",\"\",VLOOKUP(E364,Lookup!$A$2:$B$13,2,FALSE))","v":"Nov"},2041,null,null,null,null,null,null,null,null,null,null,null,null,null,null,null,null,null,null,null,null,null,null,null,null,{"$f":"IF(OR(AND(E365=\"Feb\",OR(F365=2020,OR(F365=2024,OR(F365=2028,OR(F365=2032,OR(F365=2036,F365=2040)))))),AND(E365=\"Feb\",OR(F365=2044,OR(F365=2048,F365=2052)))),29,VLOOKUP(E365,Lookup!$B$2:$C$13,2,FALSE))","v":30},0,null,null,20]
[null,null,null,20,{"$f":"IF(E365=\"\",\"\",VLOOKUP(E365,Lookup!$A$2:$B$13,2,FALSE))","v":"Dec"},2041,null,null,null,null,null,null,null,null,null,null,null,null,null,null,null,null,null,null,null,null,null,null,null,null,{"$f":"IF(OR(AND(E366=\"Feb\",OR(F366=2020,OR(F366=2024,OR(F366=2028,OR(F366=2032,OR(F366=2036,F366=2040)))))),AND(E366=\"Feb\",OR(F366=2044,OR(F366=2048,F366=2052)))),29,VLOOKUP(E366,Lookup!$B$2:$C$13,2,FALSE))","v":31},0,null,null,20]
[null,null,null,21,{"$f":"IF(E366=\"\",\"\",VLOOKUP(E366,Lookup!$A$2:$B$13,2,FALSE))","v":"Jan"},2042,null,null,null,null,null,null,null,null,null,null,null,null,null,null,null,null,null,null,null,null,null,null,null,null,{"$f":"IF(OR(AND(E367=\"Feb\",OR(F367=2020,OR(F367=2024,OR(F367=2028,OR(F367=2032,OR(F367=2036,F367=2040)))))),AND(E367=\"Feb\",OR(F367=2044,OR(F367=2048,F367=2052)))),29,VLOOKUP(E367,Lookup!$B$2:$C$13,2,FALSE))","v":31},0,null,null,{"$f":"+D367","v":21}]
[null,null,null,21,{"$f":"IF(E367=\"\",\"\",VLOOKUP(E367,Lookup!$A$2:$B$13,2,FALSE))","v":"Feb"},2042,null,null,null,null,null,null,null,null,null,null,null,null,null,null,null,null,null,null,null,null,null,null,null,null,{"$f":"IF(OR(AND(E368=\"Feb\",OR(F368=2020,OR(F368=2024,OR(F368=2028,OR(F368=2032,OR(F368=2036,F368=2040)))))),AND(E368=\"Feb\",OR(F368=2044,OR(F368=2048,F368=2052)))),29,VLOOKUP(E368,Lookup!$B$2:$C$13,2,FALSE))","v":28},0,null,null,{"$f":"+D368","v":21}]
[null,null,null,21,{"$f":"IF(E368=\"\",\"\",VLOOKUP(E368,Lookup!$A$2:$B$13,2,FALSE))","v":"Mar"},2042,null,null,null,null,null,null,null,null,null,null,null,null,null,null,null,null,null,null,null,null,null,null,null,null,{"$f":"IF(OR(AND(E369=\"Feb\",OR(F369=2020,OR(F369=2024,OR(F369=2028,OR(F369=2032,OR(F369=2036,F369=2040)))))),AND(E369=\"Feb\",OR(F369=2044,OR(F369=2048,F369=2052)))),29,VLOOKUP(E369,Lookup!$B$2:$C$13,2,FALSE))","v":31},0,null,null,21]
[null,null,null,21,{"$f":"IF(E369=\"\",\"\",VLOOKUP(E369,Lookup!$A$2:$B$13,2,FALSE))","v":"Apr"},2042,null,null,null,null,null,null,null,null,null,null,null,null,null,null,null,null,null,null,null,null,null,null,null,null,{"$f":"IF(OR(AND(E370=\"Feb\",OR(F370=2020,OR(F370=2024,OR(F370=2028,OR(F370=2032,OR(F370=2036,F370=2040)))))),AND(E370=\"Feb\",OR(F370=2044,OR(F370=2048,F370=2052)))),29,VLOOKUP(E370,Lookup!$B$2:$C$13,2,FALSE))","v":30},0,null,null,21]
[null,null,null,21,{"$f":"IF(E370=\"\",\"\",VLOOKUP(E370,Lookup!$A$2:$B$13,2,FALSE))","v":"May"},2042,null,null,null,null,null,null,null,null,null,null,null,null,null,null,null,null,null,null,null,null,null,null,null,null,{"$f":"IF(OR(AND(E371=\"Feb\",OR(F371=2020,OR(F371=2024,OR(F371=2028,OR(F371=2032,OR(F371=2036,F371=2040)))))),AND(E371=\"Feb\",OR(F371=2044,OR(F371=2048,F371=2052)))),29,VLOOKUP(E371,Lookup!$B$2:$C$13,2,FALSE))","v":31},0,null,null,21]
[null,null,null,21,{"$f":"IF(E371=\"\",\"\",VLOOKUP(E371,Lookup!$A$2:$B$13,2,FALSE))","v":"Jun"},2042,null,null,null,null,null,null,null,null,null,null,null,null,null,null,null,null,null,null,null,null,null,null,null,null,{"$f":"IF(OR(AND(E372=\"Feb\",OR(F372=2020,OR(F372=2024,OR(F372=2028,OR(F372=2032,OR(F372=2036,F372=2040)))))),AND(E372=\"Feb\",OR(F372=2044,OR(F372=2048,F372=2052)))),29,VLOOKUP(E372,Lookup!$B$2:$C$13,2,FALSE))","v":30},0,null,null,21]
[null,null,null,21,{"$f":"IF(E372=\"\",\"\",VLOOKUP(E372,Lookup!$A$2:$B$13,2,FALSE))","v":"Jul"},2042,null,null,null,null,null,null,null,null,null,null,null,null,null,null,null,null,null,null,null,null,null,null,null,null,{"$f":"IF(OR(AND(E373=\"Feb\",OR(F373=2020,OR(F373=2024,OR(F373=2028,OR(F373=2032,OR(F373=2036,F373=2040)))))),AND(E373=\"Feb\",OR(F373=2044,OR(F373=2048,F373=2052)))),29,VLOOKUP(E373,Lookup!$B$2:$C$13,2,FALSE))","v":31},0,null,null,21]
[null,null,null,21,{"$f":"IF(E373=\"\",\"\",VLOOKUP(E373,Lookup!$A$2:$B$13,2,FALSE))","v":"Aug"},2042,null,null,null,null,null,null,null,null,null,null,null,null,null,null,null,null,null,null,null,null,null,null,null,null,{"$f":"IF(OR(AND(E374=\"Feb\",OR(F374=2020,OR(F374=2024,OR(F374=2028,OR(F374=2032,OR(F374=2036,F374=2040)))))),AND(E374=\"Feb\",OR(F374=2044,OR(F374=2048,F374=2052)))),29,VLOOKUP(E374,Lookup!$B$2:$C$13,2,FALSE))","v":31},0,null,null,21]
[null,null,null,21,{"$f":"IF(E374=\"\",\"\",VLOOKUP(E374,Lookup!$A$2:$B$13,2,FALSE))","v":"Sep"},2042,null,null,null,null,null,null,null,null,null,null,null,null,null,null,null,null,null,null,null,null,null,null,null,null,{"$f":"IF(OR(AND(E375=\"Feb\",OR(F375=2020,OR(F375=2024,OR(F375=2028,OR(F375=2032,OR(F375=2036,F375=2040)))))),AND(E375=\"Feb\",OR(F375=2044,OR(F375=2048,F375=2052)))),29,VLOOKUP(E375,Lookup!$B$2:$C$13,2,FALSE))","v":30},0,null,null,21]
[null,null,null,21,{"$f":"IF(E375=\"\",\"\",VLOOKUP(E375,Lookup!$A$2:$B$13,2,FALSE))","v":"Oct"},2042,null,null,null,null,null,null,null,null,null,null,null,null,null,null,null,null,null,null,null,null,null,null,null,null,{"$f":"IF(OR(AND(E376=\"Feb\",OR(F376=2020,OR(F376=2024,OR(F376=2028,OR(F376=2032,OR(F376=2036,F376=2040)))))),AND(E376=\"Feb\",OR(F376=2044,OR(F376=2048,F376=2052)))),29,VLOOKUP(E376,Lookup!$B$2:$C$13,2,FALSE))","v":31},0,null,null,21]
[null,null,null,21,{"$f":"IF(E376=\"\",\"\",VLOOKUP(E376,Lookup!$A$2:$B$13,2,FALSE))","v":"Nov"},2042,null,null,null,null,null,null,null,null,null,null,null,null,null,null,null,null,null,null,null,null,null,null,null,null,{"$f":"IF(OR(AND(E377=\"Feb\",OR(F377=2020,OR(F377=2024,OR(F377=2028,OR(F377=2032,OR(F377=2036,F377=2040)))))),AND(E377=\"Feb\",OR(F377=2044,OR(F377=2048,F377=2052)))),29,VLOOKUP(E377,Lookup!$B$2:$C$13,2,FALSE))","v":30},0,null,null,21]
[null,null,null,21,{"$f":"IF(E377=\"\",\"\",VLOOKUP(E377,Lookup!$A$2:$B$13,2,FALSE))","v":"Dec"},2042,null,null,null,null,null,null,null,null,null,null,null,null,null,null,null,null,null,null,null,null,null,null,null,null,{"$f":"IF(OR(AND(E378=\"Feb\",OR(F378=2020,OR(F378=2024,OR(F378=2028,OR(F378=2032,OR(F378=2036,F378=2040)))))),AND(E378=\"Feb\",OR(F378=2044,OR(F378=2048,F378=2052)))),29,VLOOKUP(E378,Lookup!$B$2:$C$13,2,FALSE))","v":31},0,null,null,21]
[null,null,null,22,{"$f":"IF(E378=\"\",\"\",VLOOKUP(E378,Lookup!$A$2:$B$13,2,FALSE))","v":"Jan"},2043,null,null,null,null,null,null,null,null,null,null,null,null,null,null,null,null,null,null,null,null,null,null,null,null,{"$f":"IF(OR(AND(E379=\"Feb\",OR(F379=2020,OR(F379=2024,OR(F379=2028,OR(F379=2032,OR(F379=2036,F379=2040)))))),AND(E379=\"Feb\",OR(F379=2044,OR(F379=2048,F379=2052)))),29,VLOOKUP(E379,Lookup!$B$2:$C$13,2,FALSE))","v":31},0,null,null,22]
[null,null,null,22,{"$f":"IF(E379=\"\",\"\",VLOOKUP(E379,Lookup!$A$2:$B$13,2,FALSE))","v":"Feb"},2043,null,null,null,null,null,null,null,null,null,null,null,null,null,null,null,null,null,null,null,null,null,null,null,null,{"$f":"IF(OR(AND(E380=\"Feb\",OR(F380=2020,OR(F380=2024,OR(F380=2028,OR(F380=2032,OR(F380=2036,F380=2040)))))),AND(E380=\"Feb\",OR(F380=2044,OR(F380=2048,F380=2052)))),29,VLOOKUP(E380,Lookup!$B$2:$C$13,2,FALSE))","v":28},0,null,null,22]
[null,null,null,22,{"$f":"IF(E380=\"\",\"\",VLOOKUP(E380,Lookup!$A$2:$B$13,2,FALSE))","v":"Mar"},2043,null,null,null,null,null,null,null,null,null,null,null,null,null,null,null,null,null,null,null,null,null,null,null,null,{"$f":"IF(OR(AND(E381=\"Feb\",OR(F381=2020,OR(F381=2024,OR(F381=2028,OR(F381=2032,OR(F381=2036,F381=2040)))))),AND(E381=\"Feb\",OR(F381=2044,OR(F381=2048,F381=2052)))),29,VLOOKUP(E381,Lookup!$B$2:$C$13,2,FALSE))","v":31},0,null,null,22]
[null,null,null,22,{"$f":"IF(E381=\"\",\"\",VLOOKUP(E381,Lookup!$A$2:$B$13,2,FALSE))","v":"Apr"},2043,null,null,null,null,null,null,null,null,null,null,null,null,null,null,null,null,null,null,null,null,null,null,null,null,{"$f":"IF(OR(AND(E382=\"Feb\",OR(F382=2020,OR(F382=2024,OR(F382=2028,OR(F382=2032,OR(F382=2036,F382=2040)))))),AND(E382=\"Feb\",OR(F382=2044,OR(F382=2048,F382=2052)))),29,VLOOKUP(E382,Lookup!$B$2:$C$13,2,FALSE))","v":30},0,null,null,22]
[null,null,null,22,{"$f":"IF(E382=\"\",\"\",VLOOKUP(E382,Lookup!$A$2:$B$13,2,FALSE))","v":"May"},2043,null,null,null,null,null,null,null,null,null,null,null,null,null,null,null,null,null,null,null,null,null,null,null,null,{"$f":"IF(OR(AND(E383=\"Feb\",OR(F383=2020,OR(F383=2024,OR(F383=2028,OR(F383=2032,OR(F383=2036,F383=2040)))))),AND(E383=\"Feb\",OR(F383=2044,OR(F383=2048,F383=2052)))),29,VLOOKUP(E383,Lookup!$B$2:$C$13,2,FALSE))","v":31},{"$f":"SUM(G383:AD383)*AE383","v":0},null,null,22]
[null,null,null,22,{"$f":"IF(E383=\"\",\"\",VLOOKUP(E383,Lookup!$A$2:$B$13,2,FALSE))","v":"Jun"},2043,null,null,null,null,null,null,null,null,null,null,null,null,null,null,null,null,null,null,null,null,null,null,null,null,{"$f":"IF(OR(AND(E384=\"Feb\",OR(F384=2020,OR(F384=2024,OR(F384=2028,OR(F384=2032,OR(F384=2036,F384=2040)))))),AND(E384=\"Feb\",OR(F384=2044,OR(F384=2048,F384=2052)))),29,VLOOKUP(E384,Lookup!$B$2:$C$13,2,FALSE))","v":30},0,null,null,22]
[null,null,null,22,{"$f":"IF(E384=\"\",\"\",VLOOKUP(E384,Lookup!$A$2:$B$13,2,FALSE))","v":"Jul"},2043,null,null,null,null,null,null,null,null,null,null,null,null,null,null,null,null,null,null,null,null,null,null,null,null,{"$f":"IF(OR(AND(E385=\"Feb\",OR(F385=2020,OR(F385=2024,OR(F385=2028,OR(F385=2032,OR(F385=2036,F385=2040)))))),AND(E385=\"Feb\",OR(F385=2044,OR(F385=2048,F385=2052)))),29,VLOOKUP(E385,Lookup!$B$2:$C$13,2,FALSE))","v":31},0,null,null,22]
[null,null,null,22,{"$f":"IF(E385=\"\",\"\",VLOOKUP(E385,Lookup!$A$2:$B$13,2,FALSE))","v":"Aug"},2043,null,null,null,null,null,null,null,null,null,null,null,null,null,null,null,null,null,null,null,null,null,null,null,null,{"$f":"IF(OR(AND(E386=\"Feb\",OR(F386=2020,OR(F386=2024,OR(F386=2028,OR(F386=2032,OR(F386=2036,F386=2040)))))),AND(E386=\"Feb\",OR(F386=2044,OR(F386=2048,F386=2052)))),29,VLOOKUP(E386,Lookup!$B$2:$C$13,2,FALSE))","v":31},0,null,null,22]
[null,null,null,22,{"$f":"IF(E386=\"\",\"\",VLOOKUP(E386,Lookup!$A$2:$B$13,2,FALSE))","v":"Sep"},2043,null,null,null,null,null,null,null,null,null,null,null,null,null,null,null,null,null,null,null,null,null,null,null,null,{"$f":"IF(OR(AND(E387=\"Feb\",OR(F387=2020,OR(F387=2024,OR(F387=2028,OR(F387=2032,OR(F387=2036,F387=2040)))))),AND(E387=\"Feb\",OR(F387=2044,OR(F387=2048,F387=2052)))),29,VLOOKUP(E387,Lookup!$B$2:$C$13,2,FALSE))","v":30},0,null,null,22]
[null,null,null,22,{"$f":"IF(E387=\"\",\"\",VLOOKUP(E387,Lookup!$A$2:$B$13,2,FALSE))","v":"Oct"},2043,null,null,null,null,null,null,null,null,null,null,null,null,null,null,null,null,null,null,null,null,null,null,null,null,{"$f":"IF(OR(AND(E388=\"Feb\",OR(F388=2020,OR(F388=2024,OR(F388=2028,OR(F388=2032,OR(F388=2036,F388=2040)))))),AND(E388=\"Feb\",OR(F388=2044,OR(F388=2048,F388=2052)))),29,VLOOKUP(E388,Lookup!$B$2:$C$13,2,FALSE))","v":31},0,null,null,22]
[null,null,null,22,{"$f":"IF(E388=\"\",\"\",VLOOKUP(E388,Lookup!$A$2:$B$13,2,FALSE))","v":"Nov"},2043,null,null,null,null,null,null,null,null,null,null,null,null,null,null,null,null,null,null,null,null,null,null,null,null,{"$f":"IF(OR(AND(E389=\"Feb\",OR(F389=2020,OR(F389=2024,OR(F389=2028,OR(F389=2032,OR(F389=2036,F389=2040)))))),AND(E389=\"Feb\",OR(F389=2044,OR(F389=2048,F389=2052)))),29,VLOOKUP(E389,Lookup!$B$2:$C$13,2,FALSE))","v":30},0,null,null,22]
[null,null,null,22,{"$f":"IF(E389=\"\",\"\",VLOOKUP(E389,Lookup!$A$2:$B$13,2,FALSE))","v":"Dec"},2043,null,null,null,null,null,null,null,null,null,null,null,null,null,null,null,null,null,null,null,null,null,null,null,null,{"$f":"IF(OR(AND(E390=\"Feb\",OR(F390=2020,OR(F390=2024,OR(F390=2028,OR(F390=2032,OR(F390=2036,F390=2040)))))),AND(E390=\"Feb\",OR(F390=2044,OR(F390=2048,F390=2052)))),29,VLOOKUP(E390,Lookup!$B$2:$C$13,2,FALSE))","v":31},0,null,null,22]
[null,null,null,23,{"$f":"IF(E390=\"\",\"\",VLOOKUP(E390,Lookup!$A$2:$B$13,2,FALSE))","v":"Jan"},2044,null,null,null,null,null,null,null,null,null,null,null,null,null,null,null,null,null,null,null,null,null,null,null,null,{"$f":"IF(OR(AND(E391=\"Feb\",OR(F391=2020,OR(F391=2024,OR(F391=2028,OR(F391=2032,OR(F391=2036,F391=2040)))))),AND(E391=\"Feb\",OR(F391=2044,OR(F391=2048,F391=2052)))),29,VLOOKUP(E391,Lookup!$B$2:$C$13,2,FALSE))","v":31},0,null,null,{"$f":"+D391","v":23}]
[null,null,null,23,{"$f":"IF(E391=\"\",\"\",VLOOKUP(E391,Lookup!$A$2:$B$13,2,FALSE))","v":"Feb"},2044,null,null,null,null,null,null,null,null,null,null,null,null,null,null,null,null,null,null,null,null,null,null,null,null,{"$f":"IF(OR(AND(E392=\"Feb\",OR(F392=2020,OR(F392=2024,OR(F392=2028,OR(F392=2032,OR(F392=2036,F392=2040)))))),AND(E392=\"Feb\",OR(F392=2044,OR(F392=2048,F392=2052)))),29,VLOOKUP(E392,Lookup!$B$2:$C$13,2,FALSE))","v":29},0,null,null,{"$f":"+D392","v":23}]
[null,null,null,23,{"$f":"IF(E392=\"\",\"\",VLOOKUP(E392,Lookup!$A$2:$B$13,2,FALSE))","v":"Mar"},2044,null,null,null,null,null,null,null,null,null,null,null,null,null,null,null,null,null,null,null,null,null,null,null,null,{"$f":"IF(OR(AND(E393=\"Feb\",OR(F393=2020,OR(F393=2024,OR(F393=2028,OR(F393=2032,OR(F393=2036,F393=2040)))))),AND(E393=\"Feb\",OR(F393=2044,OR(F393=2048,F393=2052)))),29,VLOOKUP(E393,Lookup!$B$2:$C$13,2,FALSE))","v":31},0,null,null,23]
[null,null,null,23,{"$f":"IF(E393=\"\",\"\",VLOOKUP(E393,Lookup!$A$2:$B$13,2,FALSE))","v":"Apr"},2044,null,null,null,null,null,null,null,null,null,null,null,null,null,null,null,null,null,null,null,null,null,null,null,null,{"$f":"IF(OR(AND(E394=\"Feb\",OR(F394=2020,OR(F394=2024,OR(F394=2028,OR(F394=2032,OR(F394=2036,F394=2040)))))),AND(E394=\"Feb\",OR(F394=2044,OR(F394=2048,F394=2052)))),29,VLOOKUP(E394,Lookup!$B$2:$C$13,2,FALSE))","v":30},0,null,null,23]
[null,null,null,23,{"$f":"IF(E394=\"\",\"\",VLOOKUP(E394,Lookup!$A$2:$B$13,2,FALSE))","v":"May"},2044,null,null,null,null,null,null,null,null,null,null,null,null,null,null,null,null,null,null,null,null,null,null,null,null,{"$f":"IF(OR(AND(E395=\"Feb\",OR(F395=2020,OR(F395=2024,OR(F395=2028,OR(F395=2032,OR(F395=2036,F395=2040)))))),AND(E395=\"Feb\",OR(F395=2044,OR(F395=2048,F395=2052)))),29,VLOOKUP(E395,Lookup!$B$2:$C$13,2,FALSE))","v":31},0,null,null,23]
[null,null,null,{"$f":"+D384+1","v":23},{"$f":"IF(E395=\"\",\"\",VLOOKUP(E395,Lookup!$A$2:$B$13,2,FALSE))","v":"Jun"},2044,null,null,null,null,null,null,null,null,null,null,null,null,null,null,null,null,null,null,null,null,null,null,null,null,{"$f":"IF(OR(AND(E396=\"Feb\",OR(F396=2020,OR(F396=2024,OR(F396=2028,OR(F396=2032,OR(F396=2036,F396=2040)))))),AND(E396=\"Feb\",OR(F396=2044,OR(F396=2048,F396=2052)))),29,VLOOKUP(E396,Lookup!$B$2:$C$13,2,FALSE))","v":30},0,null,null,23]
[null,null,null,23,{"$f":"IF(E396=\"\",\"\",VLOOKUP(E396,Lookup!$A$2:$B$13,2,FALSE))","v":"Jul"},2044,null,null,null,null,null,null,null,null,null,null,null,null,null,null,null,null,null,null,null,null,null,null,null,null,{"$f":"IF(OR(AND(E397=\"Feb\",OR(F397=2020,OR(F397=2024,OR(F397=2028,OR(F397=2032,OR(F397=2036,F397=2040)))))),AND(E397=\"Feb\",OR(F397=2044,OR(F397=2048,F397=2052)))),29,VLOOKUP(E397,Lookup!$B$2:$C$13,2,FALSE))","v":31},0,null,null,23]
[null,null,null,23,{"$f":"IF(E397=\"\",\"\",VLOOKUP(E397,Lookup!$A$2:$B$13,2,FALSE))","v":"Aug"},2044,null,null,null,null,null,null,null,null,null,null,null,null,null,null,null,null,null,null,null,null,null,null,null,null,{"$f":"IF(OR(AND(E398=\"Feb\",OR(F398=2020,OR(F398=2024,OR(F398=2028,OR(F398=2032,OR(F398=2036,F398=2040)))))),AND(E398=\"Feb\",OR(F398=2044,OR(F398=2048,F398=2052)))),29,VLOOKUP(E398,Lookup!$B$2:$C$13,2,FALSE))","v":31},0,null,null,23]
[null,null,null,23,{"$f":"IF(E398=\"\",\"\",VLOOKUP(E398,Lookup!$A$2:$B$13,2,FALSE))","v":"Sep"},2044,null,null,null,null,null,null,null,null,null,null,null,null,null,null,null,null,null,null,null,null,null,null,null,null,{"$f":"IF(OR(AND(E399=\"Feb\",OR(F399=2020,OR(F399=2024,OR(F399=2028,OR(F399=2032,OR(F399=2036,F399=2040)))))),AND(E399=\"Feb\",OR(F399=2044,OR(F399=2048,F399=2052)))),29,VLOOKUP(E399,Lookup!$B$2:$C$13,2,FALSE))","v":30},0,null,null,23]
[null,null,null,23,{"$f":"IF(E399=\"\",\"\",VLOOKUP(E399,Lookup!$A$2:$B$13,2,FALSE))","v":"Oct"},2044,null,null,null,null,null,null,null,null,null,null,null,null,null,null,null,null,null,null,null,null,null,null,null,null,{"$f":"IF(OR(AND(E400=\"Feb\",OR(F400=2020,OR(F400=2024,OR(F400=2028,OR(F400=2032,OR(F400=2036,F400=2040)))))),AND(E400=\"Feb\",OR(F400=2044,OR(F400=2048,F400=2052)))),29,VLOOKUP(E400,Lookup!$B$2:$C$13,2,FALSE))","v":31},0,null,null,23]
[null,null,null,23,{"$f":"IF(E400=\"\",\"\",VLOOKUP(E400,Lookup!$A$2:$B$13,2,FALSE))","v":"Nov"},2044,null,null,null,null,null,null,null,null,null,null,null,null,null,null,null,null,null,null,null,null,null,null,null,null,{"$f":"IF(OR(AND(E401=\"Feb\",OR(F401=2020,OR(F401=2024,OR(F401=2028,OR(F401=2032,OR(F401=2036,F401=2040)))))),AND(E401=\"Feb\",OR(F401=2044,OR(F401=2048,F401=2052)))),29,VLOOKUP(E401,Lookup!$B$2:$C$13,2,FALSE))","v":30},0,null,null,23]
[null,null,null,23,{"$f":"IF(E401=\"\",\"\",VLOOKUP(E401,Lookup!$A$2:$B$13,2,FALSE))","v":"Dec"},2044,null,null,null,null,null,null,null,null,null,null,null,null,null,null,null,null,null,null,null,null,null,null,null,null,{"$f":"IF(OR(AND(E402=\"Feb\",OR(F402=2020,OR(F402=2024,OR(F402=2028,OR(F402=2032,OR(F402=2036,F402=2040)))))),AND(E402=\"Feb\",OR(F402=2044,OR(F402=2048,F402=2052)))),29,VLOOKUP(E402,Lookup!$B$2:$C$13,2,FALSE))","v":31},0,null,null,23]
[null,null,null,24,{"$f":"IF(E402=\"\",\"\",VLOOKUP(E402,Lookup!$A$2:$B$13,2,FALSE))","v":"Jan"},2045,null,null,null,null,null,null,null,null,null,null,null,null,null,null,null,null,null,null,null,null,null,null,null,null,{"$f":"IF(OR(AND(E403=\"Feb\",OR(F403=2020,OR(F403=2024,OR(F403=2028,OR(F403=2032,OR(F403=2036,F403=2040)))))),AND(E403=\"Feb\",OR(F403=2044,OR(F403=2048,F403=2052)))),29,VLOOKUP(E403,Lookup!$B$2:$C$13,2,FALSE))","v":31},0,null,null,24]
[null,null,null,24,{"$f":"IF(E403=\"\",\"\",VLOOKUP(E403,Lookup!$A$2:$B$13,2,FALSE))","v":"Feb"},2045,null,null,null,null,null,null,null,null,null,null,null,null,null,null,null,null,null,null,null,null,null,null,null,null,{"$f":"IF(OR(AND(E404=\"Feb\",OR(F404=2020,OR(F404=2024,OR(F404=2028,OR(F404=2032,OR(F404=2036,F404=2040)))))),AND(E404=\"Feb\",OR(F404=2044,OR(F404=2048,F404=2052)))),29,VLOOKUP(E404,Lookup!$B$2:$C$13,2,FALSE))","v":28},0,null,null,24]
[null,null,null,24,{"$f":"IF(E404=\"\",\"\",VLOOKUP(E404,Lookup!$A$2:$B$13,2,FALSE))","v":"Mar"},2045,null,null,null,null,null,null,null,null,null,null,null,null,null,null,null,null,null,null,null,null,null,null,null,null,{"$f":"IF(OR(AND(E405=\"Feb\",OR(F405=2020,OR(F405=2024,OR(F405=2028,OR(F405=2032,OR(F405=2036,F405=2040)))))),AND(E405=\"Feb\",OR(F405=2044,OR(F405=2048,F405=2052)))),29,VLOOKUP(E405,Lookup!$B$2:$C$13,2,FALSE))","v":31},0,null,null,24]
[null,null,null,24,{"$f":"IF(E405=\"\",\"\",VLOOKUP(E405,Lookup!$A$2:$B$13,2,FALSE))","v":"Apr"},2045,null,null,null,null,null,null,null,null,null,null,null,null,null,null,null,null,null,null,null,null,null,null,null,null,{"$f":"IF(OR(AND(E406=\"Feb\",OR(F406=2020,OR(F406=2024,OR(F406=2028,OR(F406=2032,OR(F406=2036,F406=2040)))))),AND(E406=\"Feb\",OR(F406=2044,OR(F406=2048,F406=2052)))),29,VLOOKUP(E406,Lookup!$B$2:$C$13,2,FALSE))","v":30},0,null,null,24]
[null,null,null,24,{"$f":"IF(E406=\"\",\"\",VLOOKUP(E406,Lookup!$A$2:$B$13,2,FALSE))","v":"May"},2045,null,null,null,null,null,null,null,null,null,null,null,null,null,null,null,null,null,null,null,null,null,null,null,null,{"$f":"IF(OR(AND(E407=\"Feb\",OR(F407=2020,OR(F407=2024,OR(F407=2028,OR(F407=2032,OR(F407=2036,F407=2040)))))),AND(E407=\"Feb\",OR(F407=2044,OR(F407=2048,F407=2052)))),29,VLOOKUP(E407,Lookup!$B$2:$C$13,2,FALSE))","v":31},0,null,null,24]
[null,null,null,24,{"$f":"IF(E407=\"\",\"\",VLOOKUP(E407,Lookup!$A$2:$B$13,2,FALSE))","v":"Jun"},2045,null,null,null,null,null,null,null,null,null,null,null,null,null,null,null,null,null,null,null,null,null,null,null,null,{"$f":"IF(OR(AND(E408=\"Feb\",OR(F408=2020,OR(F408=2024,OR(F408=2028,OR(F408=2032,OR(F408=2036,F408=2040)))))),AND(E408=\"Feb\",OR(F408=2044,OR(F408=2048,F408=2052)))),29,VLOOKUP(E408,Lookup!$B$2:$C$13,2,FALSE))","v":30},0,null,null,24]
[null,null,null,24,{"$f":"IF(E408=\"\",\"\",VLOOKUP(E408,Lookup!$A$2:$B$13,2,FALSE))","v":"Jul"},2045,null,null,null,null,null,null,null,null,null,null,null,null,null,null,null,null,null,null,null,null,null,null,null,null,{"$f":"IF(OR(AND(E409=\"Feb\",OR(F409=2020,OR(F409=2024,OR(F409=2028,OR(F409=2032,OR(F409=2036,F409=2040)))))),AND(E409=\"Feb\",OR(F409=2044,OR(F409=2048,F409=2052)))),29,VLOOKUP(E409,Lookup!$B$2:$C$13,2,FALSE))","v":31},0,null,null,24]
[null,null,null,24,{"$f":"IF(E409=\"\",\"\",VLOOKUP(E409,Lookup!$A$2:$B$13,2,FALSE))","v":"Aug"},2045,null,null,null,null,null,null,null,null,null,null,null,null,null,null,null,null,null,null,null,null,null,null,null,null,{"$f":"IF(OR(AND(E410=\"Feb\",OR(F410=2020,OR(F410=2024,OR(F410=2028,OR(F410=2032,OR(F410=2036,F410=2040)))))),AND(E410=\"Feb\",OR(F410=2044,OR(F410=2048,F410=2052)))),29,VLOOKUP(E410,Lookup!$B$2:$C$13,2,FALSE))","v":31},0,null,null,24]
[null,null,null,24,{"$f":"IF(E410=\"\",\"\",VLOOKUP(E410,Lookup!$A$2:$B$13,2,FALSE))","v":"Sep"},2045,null,null,null,null,null,null,null,null,null,null,null,null,null,null,null,null,null,null,null,null,null,null,null,null,{"$f":"IF(OR(AND(E411=\"Feb\",OR(F411=2020,OR(F411=2024,OR(F411=2028,OR(F411=2032,OR(F411=2036,F411=2040)))))),AND(E411=\"Feb\",OR(F411=2044,OR(F411=2048,F411=2052)))),29,VLOOKUP(E411,Lookup!$B$2:$C$13,2,FALSE))","v":30},0,null,null,24]
[null,null,null,24,{"$f":"IF(E411=\"\",\"\",VLOOKUP(E411,Lookup!$A$2:$B$13,2,FALSE))","v":"Oct"},2045,null,null,null,null,null,null,null,null,null,null,null,null,null,null,null,null,null,null,null,null,null,null,null,null,{"$f":"IF(OR(AND(E412=\"Feb\",OR(F412=2020,OR(F412=2024,OR(F412=2028,OR(F412=2032,OR(F412=2036,F412=2040)))))),AND(E412=\"Feb\",OR(F412=2044,OR(F412=2048,F412=2052)))),29,VLOOKUP(E412,Lookup!$B$2:$C$13,2,FALSE))","v":31},0,null,null,24]
[null,null,null,24,{"$f":"IF(E412=\"\",\"\",VLOOKUP(E412,Lookup!$A$2:$B$13,2,FALSE))","v":"Nov"},2045,null,null,null,null,null,null,null,null,null,null,null,null,null,null,null,null,null,null,null,null,null,null,null,null,{"$f":"IF(OR(AND(E413=\"Feb\",OR(F413=2020,OR(F413=2024,OR(F413=2028,OR(F413=2032,OR(F413=2036,F413=2040)))))),AND(E413=\"Feb\",OR(F413=2044,OR(F413=2048,F413=2052)))),29,VLOOKUP(E413,Lookup!$B$2:$C$13,2,FALSE))","v":30},0,null,null,24]
[null,null,null,24,{"$f":"IF(E413=\"\",\"\",VLOOKUP(E413,Lookup!$A$2:$B$13,2,FALSE))","v":"Dec"},2045,null,null,null,null,null,null,null,null,null,null,null,null,null,null,null,null,null,null,null,null,null,null,null,null,{"$f":"IF(OR(AND(E414=\"Feb\",OR(F414=2020,OR(F414=2024,OR(F414=2028,OR(F414=2032,OR(F414=2036,F414=2040)))))),AND(E414=\"Feb\",OR(F414=2044,OR(F414=2048,F414=2052)))),29,VLOOKUP(E414,Lookup!$B$2:$C$13,2,FALSE))","v":31},0,null,null,24]
[null,null,null,25,{"$f":"IF(E414=\"\",\"\",VLOOKUP(E414,Lookup!$A$2:$B$13,2,FALSE))","v":"Jan"},2046,null,null,null,null,null,null,null,null,null,null,null,null,null,null,null,null,null,null,null,null,null,null,null,null,{"$f":"IF(OR(AND(E415=\"Feb\",OR(F415=2020,OR(F415=2024,OR(F415=2028,OR(F415=2032,OR(F415=2036,F415=2040)))))),AND(E415=\"Feb\",OR(F415=2044,OR(F415=2048,F415=2052)))),29,VLOOKUP(E415,Lookup!$B$2:$C$13,2,FALSE))","v":31},0,null,null,{"$f":"+D415","v":25}]
[null,null,null,25,{"$f":"IF(E415=\"\",\"\",VLOOKUP(E415,Lookup!$A$2:$B$13,2,FALSE))","v":"Feb"},2046,null,null,null,null,null,null,null,null,null,null,null,null,null,null,null,null,null,null,null,null,null,null,null,null,{"$f":"IF(OR(AND(E416=\"Feb\",OR(F416=2020,OR(F416=2024,OR(F416=2028,OR(F416=2032,OR(F416=2036,F416=2040)))))),AND(E416=\"Feb\",OR(F416=2044,OR(F416=2048,F416=2052)))),29,VLOOKUP(E416,Lookup!$B$2:$C$13,2,FALSE))","v":28},0,null,null,{"$f":"+D416","v":25}]
[null,null,null,25,{"$f":"IF(E416=\"\",\"\",VLOOKUP(E416,Lookup!$A$2:$B$13,2,FALSE))","v":"Mar"},2046,null,null,null,null,null,null,null,null,null,null,null,null,null,null,null,null,null,null,null,null,null,null,null,null,{"$f":"IF(OR(AND(E417=\"Feb\",OR(F417=2020,OR(F417=2024,OR(F417=2028,OR(F417=2032,OR(F417=2036,F417=2040)))))),AND(E417=\"Feb\",OR(F417=2044,OR(F417=2048,F417=2052)))),29,VLOOKUP(E417,Lookup!$B$2:$C$13,2,FALSE))","v":31},0,null,null,25]
[null,null,null,25,{"$f":"IF(E417=\"\",\"\",VLOOKUP(E417,Lookup!$A$2:$B$13,2,FALSE))","v":"Apr"},2046,null,null,null,null,null,null,null,null,null,null,null,null,null,null,null,null,null,null,null,null,null,null,null,null,{"$f":"IF(OR(AND(E418=\"Feb\",OR(F418=2020,OR(F418=2024,OR(F418=2028,OR(F418=2032,OR(F418=2036,F418=2040)))))),AND(E418=\"Feb\",OR(F418=2044,OR(F418=2048,F418=2052)))),29,VLOOKUP(E418,Lookup!$B$2:$C$13,2,FALSE))","v":30},0,null,null,25]
[null,null,null,25,{"$f":"IF(E418=\"\",\"\",VLOOKUP(E418,Lookup!$A$2:$B$13,2,FALSE))","v":"May"},2046,null,null,null,null,null,null,null,null,null,null,null,null,null,null,null,null,null,null,null,null,null,null,null,null,{"$f":"IF(OR(AND(E419=\"Feb\",OR(F419=2020,OR(F419=2024,OR(F419=2028,OR(F419=2032,OR(F419=2036,F419=2040)))))),AND(E419=\"Feb\",OR(F419=2044,OR(F419=2048,F419=2052)))),29,VLOOKUP(E419,Lookup!$B$2:$C$13,2,FALSE))","v":31},0,null,null,25]
[null,null,null,25,{"$f":"IF(E419=\"\",\"\",VLOOKUP(E419,Lookup!$A$2:$B$13,2,FALSE))","v":"Jun"},{"$f":"IF(E419=0,\"\",IF(E419=\"Dec\",F419+1,F419))","v":2046},null,null,null,null,null,null,null,null,null,null,null,null,null,null,null,null,null,null,null,null,null,null,null,null,{"$f":"IF(OR(AND(E420=\"Feb\",OR(F420=2020,OR(F420=2024,OR(F420=2028,OR(F420=2032,OR(F420=2036,F420=2040)))))),AND(E420=\"Feb\",OR(F420=2044,OR(F420=2048,F420=2052)))),29,VLOOKUP(E420,Lookup!$B$2:$C$13,2,FALSE))","v":30},0,null,null,25]
[null,null,null,25,{"$f":"IF(E420=\"\",\"\",VLOOKUP(E420,Lookup!$A$2:$B$13,2,FALSE))","v":"Jul"},2046,null,null,null,null,null,null,null,null,null,null,null,null,null,null,null,null,null,null,null,null,null,null,null,null,{"$f":"IF(OR(AND(E421=\"Feb\",OR(F421=2020,OR(F421=2024,OR(F421=2028,OR(F421=2032,OR(F421=2036,F421=2040)))))),AND(E421=\"Feb\",OR(F421=2044,OR(F421=2048,F421=2052)))),29,VLOOKUP(E421,Lookup!$B$2:$C$13,2,FALSE))","v":31},0,null,null,25]
[null,null,null,25,{"$f":"IF(E421=\"\",\"\",VLOOKUP(E421,Lookup!$A$2:$B$13,2,FALSE))","v":"Aug"},2046,null,null,null,null,null,null,null,null,null,null,null,null,null,null,null,null,null,null,null,null,null,null,null,null,{"$f":"IF(OR(AND(E422=\"Feb\",OR(F422=2020,OR(F422=2024,OR(F422=2028,OR(F422=2032,OR(F422=2036,F422=2040)))))),AND(E422=\"Feb\",OR(F422=2044,OR(F422=2048,F422=2052)))),29,VLOOKUP(E422,Lookup!$B$2:$C$13,2,FALSE))","v":31},0,null,null,25]
[null,null,null,25,{"$f":"IF(E422=\"\",\"\",VLOOKUP(E422,Lookup!$A$2:$B$13,2,FALSE))","v":"Sep"},2046,null,null,null,null,null,null,null,null,null,null,null,null,null,null,null,null,null,null,null,null,null,null,null,null,{"$f":"IF(OR(AND(E423=\"Feb\",OR(F423=2020,OR(F423=2024,OR(F423=2028,OR(F423=2032,OR(F423=2036,F423=2040)))))),AND(E423=\"Feb\",OR(F423=2044,OR(F423=2048,F423=2052)))),29,VLOOKUP(E423,Lookup!$B$2:$C$13,2,FALSE))","v":30},0,null,null,25]
[null,null,null,25,{"$f":"IF(E423=\"\",\"\",VLOOKUP(E423,Lookup!$A$2:$B$13,2,FALSE))","v":"Oct"},2046,null,null,null,null,null,null,null,null,null,null,null,null,null,null,null,null,null,null,null,null,null,null,null,null,{"$f":"IF(OR(AND(E424=\"Feb\",OR(F424=2020,OR(F424=2024,OR(F424=2028,OR(F424=2032,OR(F424=2036,F424=2040)))))),AND(E424=\"Feb\",OR(F424=2044,OR(F424=2048,F424=2052)))),29,VLOOKUP(E424,Lookup!$B$2:$C$13,2,FALSE))","v":31},0,null,null,25]
[null,null,null,25,{"$f":"IF(E424=\"\",\"\",VLOOKUP(E424,Lookup!$A$2:$B$13,2,FALSE))","v":"Nov"},2046,null,null,null,null,null,null,null,null,null,null,null,null,null,null,null,null,null,null,null,null,null,null,null,null,{"$f":"IF(OR(AND(E425=\"Feb\",OR(F425=2020,OR(F425=2024,OR(F425=2028,OR(F425=2032,OR(F425=2036,F425=2040)))))),AND(E425=\"Feb\",OR(F425=2044,OR(F425=2048,F425=2052)))),29,VLOOKUP(E425,Lookup!$B$2:$C$13,2,FALSE))","v":30},0,null,null,25]
[null,null,null,25,{"$f":"IF(E425=\"\",\"\",VLOOKUP(E425,Lookup!$A$2:$B$13,2,FALSE))","v":"Dec"},2046,null,null,null,null,null,null,null,null,null,null,null,null,null,null,null,null,null,null,null,null,null,null,null,null,{"$f":"IF(OR(AND(E426=\"Feb\",OR(F426=2020,OR(F426=2024,OR(F426=2028,OR(F426=2032,OR(F426=2036,F426=2040)))))),AND(E426=\"Feb\",OR(F426=2044,OR(F426=2048,F426=2052)))),29,VLOOKUP(E426,Lookup!$B$2:$C$13,2,FALSE))","v":31},0,null,null,25]
[null,null,null,26,{"$f":"IF(E426=\"\",\"\",VLOOKUP(E426,Lookup!$A$2:$B$13,2,FALSE))","v":"Jan"},2047,null,null,null,null,null,null,null,null,null,null,null,null,null,null,null,null,null,null,null,null,null,null,null,null,{"$f":"IF(OR(AND(E427=\"Feb\",OR(F427=2020,OR(F427=2024,OR(F427=2028,OR(F427=2032,OR(F427=2036,F427=2040)))))),AND(E427=\"Feb\",OR(F427=2044,OR(F427=2048,F427=2052)))),29,VLOOKUP(E427,Lookup!$B$2:$C$13,2,FALSE))","v":31},0,null,null,26]
[null,null,null,26,{"$f":"IF(E427=\"\",\"\",VLOOKUP(E427,Lookup!$A$2:$B$13,2,FALSE))","v":"Feb"},2047,null,null,null,null,null,null,null,null,null,null,null,null,null,null,null,null,null,null,null,null,null,null,null,null,{"$f":"IF(OR(AND(E428=\"Feb\",OR(F428=2020,OR(F428=2024,OR(F428=2028,OR(F428=2032,OR(F428=2036,F428=2040)))))),AND(E428=\"Feb\",OR(F428=2044,OR(F428=2048,F428=2052)))),29,VLOOKUP(E428,Lookup!$B$2:$C$13,2,FALSE))","v":28},0,null,null,26]
[null,null,null,26,{"$f":"IF(E428=\"\",\"\",VLOOKUP(E428,Lookup!$A$2:$B$13,2,FALSE))","v":"Mar"},2047,null,null,null,null,null,null,null,null,null,null,null,null,null,null,null,null,null,null,null,null,null,null,null,null,{"$f":"IF(OR(AND(E429=\"Feb\",OR(F429=2020,OR(F429=2024,OR(F429=2028,OR(F429=2032,OR(F429=2036,F429=2040)))))),AND(E429=\"Feb\",OR(F429=2044,OR(F429=2048,F429=2052)))),29,VLOOKUP(E429,Lookup!$B$2:$C$13,2,FALSE))","v":31},0,null,null,26]
[null,null,null,26,{"$f":"IF(E429=\"\",\"\",VLOOKUP(E429,Lookup!$A$2:$B$13,2,FALSE))","v":"Apr"},2047,null,null,null,null,null,null,null,null,null,null,null,null,null,null,null,null,null,null,null,null,null,null,null,null,{"$f":"IF(OR(AND(E430=\"Feb\",OR(F430=2020,OR(F430=2024,OR(F430=2028,OR(F430=2032,OR(F430=2036,F430=2040)))))),AND(E430=\"Feb\",OR(F430=2044,OR(F430=2048,F430=2052)))),29,VLOOKUP(E430,Lookup!$B$2:$C$13,2,FALSE))","v":30},0,null,null,26]
[null,null,null,26,{"$f":"IF(E430=\"\",\"\",VLOOKUP(E430,Lookup!$A$2:$B$13,2,FALSE))","v":"May"},2047,null,null,null,null,null,null,null,null,null,null,null,null,null,null,null,null,null,null,null,null,null,null,null,null,{"$f":"IF(OR(AND(E431=\"Feb\",OR(F431=2020,OR(F431=2024,OR(F431=2028,OR(F431=2032,OR(F431=2036,F431=2040)))))),AND(E431=\"Feb\",OR(F431=2044,OR(F431=2048,F431=2052)))),29,VLOOKUP(E431,Lookup!$B$2:$C$13,2,FALSE))","v":31},0,null,null,26]
[null,null,null,26,{"$f":"IF(E431=\"\",\"\",VLOOKUP(E431,Lookup!$A$2:$B$13,2,FALSE))","v":"Jun"},2047,null,null,null,null,null,null,null,null,null,null,null,null,null,null,null,null,null,null,null,null,null,null,null,null,{"$f":"IF(OR(AND(E432=\"Feb\",OR(F432=2020,OR(F432=2024,OR(F432=2028,OR(F432=2032,OR(F432=2036,F432=2040)))))),AND(E432=\"Feb\",OR(F432=2044,OR(F432=2048,F432=2052)))),29,VLOOKUP(E432,Lookup!$B$2:$C$13,2,FALSE))","v":30},0,null,null,26]
[null,null,null,26,{"$f":"IF(E432=\"\",\"\",VLOOKUP(E432,Lookup!$A$2:$B$13,2,FALSE))","v":"Jul"},2047,null,null,null,null,null,null,null,null,null,null,null,null,null,null,null,null,null,null,null,null,null,null,null,null,{"$f":"IF(OR(AND(E433=\"Feb\",OR(F433=2020,OR(F433=2024,OR(F433=2028,OR(F433=2032,OR(F433=2036,F433=2040)))))),AND(E433=\"Feb\",OR(F433=2044,OR(F433=2048,F433=2052)))),29,VLOOKUP(E433,Lookup!$B$2:$C$13,2,FALSE))","v":31},0,null,null,26]
[null,null,null,26,{"$f":"IF(E433=\"\",\"\",VLOOKUP(E433,Lookup!$A$2:$B$13,2,FALSE))","v":"Aug"},2047,null,null,null,null,null,null,null,null,null,null,null,null,null,null,null,null,null,null,null,null,null,null,null,null,{"$f":"IF(OR(AND(E434=\"Feb\",OR(F434=2020,OR(F434=2024,OR(F434=2028,OR(F434=2032,OR(F434=2036,F434=2040)))))),AND(E434=\"Feb\",OR(F434=2044,OR(F434=2048,F434=2052)))),29,VLOOKUP(E434,Lookup!$B$2:$C$13,2,FALSE))","v":31},0,null,null,26]
[null,null,null,26,{"$f":"IF(E434=\"\",\"\",VLOOKUP(E434,Lookup!$A$2:$B$13,2,FALSE))","v":"Sep"},2047,null,null,null,null,null,null,null,null,null,null,null,null,null,null,null,null,null,null,null,null,null,null,null,null,{"$f":"IF(OR(AND(E435=\"Feb\",OR(F435=2020,OR(F435=2024,OR(F435=2028,OR(F435=2032,OR(F435=2036,F435=2040)))))),AND(E435=\"Feb\",OR(F435=2044,OR(F435=2048,F435=2052)))),29,VLOOKUP(E435,Lookup!$B$2:$C$13,2,FALSE))","v":30},0,null,null,26]
[null,null,null,26,{"$f":"IF(E435=\"\",\"\",VLOOKUP(E435,Lookup!$A$2:$B$13,2,FALSE))","v":"Oct"},2047,null,null,null,null,null,null,null,null,null,null,null,null,null,null,null,null,null,null,null,null,null,null,null,null,{"$f":"IF(OR(AND(E436=\"Feb\",OR(F436=2020,OR(F436=2024,OR(F436=2028,OR(F436=2032,OR(F436=2036,F436=2040)))))),AND(E436=\"Feb\",OR(F436=2044,OR(F436=2048,F436=2052)))),29,VLOOKUP(E436,Lookup!$B$2:$C$13,2,FALSE))","v":31},0,null,null,26]
[null,null,null,26,{"$f":"IF(E436=\"\",\"\",VLOOKUP(E436,Lookup!$A$2:$B$13,2,FALSE))","v":"Nov"},2047,null,null,null,null,null,null,null,null,null,null,null,null,null,null,null,null,null,null,null,null,null,null,null,null,{"$f":"IF(OR(AND(E437=\"Feb\",OR(F437=2020,OR(F437=2024,OR(F437=2028,OR(F437=2032,OR(F437=2036,F437=2040)))))),AND(E437=\"Feb\",OR(F437=2044,OR(F437=2048,F437=2052)))),29,VLOOKUP(E437,Lookup!$B$2:$C$13,2,FALSE))","v":30},0,null,null,26]
[null,null,null,26,{"$f":"IF(E437=\"\",\"\",VLOOKUP(E437,Lookup!$A$2:$B$13,2,FALSE))","v":"Dec"},2047,null,null,null,null,null,null,null,null,null,null,null,null,null,null,null,null,null,null,null,null,null,null,null,null,{"$f":"IF(OR(AND(E438=\"Feb\",OR(F438=2020,OR(F438=2024,OR(F438=2028,OR(F438=2032,OR(F438=2036,F438=2040)))))),AND(E438=\"Feb\",OR(F438=2044,OR(F438=2048,F438=2052)))),29,VLOOKUP(E438,Lookup!$B$2:$C$13,2,FALSE))","v":31},0,null,null,26]
[null,null,null,27,{"$f":"IF(E438=\"\",\"\",VLOOKUP(E438,Lookup!$A$2:$B$13,2,FALSE))","v":"Jan"},2048,null,null,null,null,null,null,null,null,null,null,null,null,null,null,null,null,null,null,null,null,null,null,null,null,{"$f":"IF(OR(AND(E439=\"Feb\",OR(F439=2020,OR(F439=2024,OR(F439=2028,OR(F439=2032,OR(F439=2036,F439=2040)))))),AND(E439=\"Feb\",OR(F439=2044,OR(F439=2048,F439=2052)))),29,VLOOKUP(E439,Lookup!$B$2:$C$13,2,FALSE))","v":31},0,null,null,{"$f":"+D439","v":27}]
[null,null,null,27,{"$f":"IF(E439=\"\",\"\",VLOOKUP(E439,Lookup!$A$2:$B$13,2,FALSE))","v":"Feb"},2048,null,null,null,null,null,null,null,null,null,null,null,null,null,null,null,null,null,null,null,null,null,null,null,null,{"$f":"IF(OR(AND(E440=\"Feb\",OR(F440=2020,OR(F440=2024,OR(F440=2028,OR(F440=2032,OR(F440=2036,F440=2040)))))),AND(E440=\"Feb\",OR(F440=2044,OR(F440=2048,F440=2052)))),29,VLOOKUP(E440,Lookup!$B$2:$C$13,2,FALSE))","v":29},0,null,null,{"$f":"+D440","v":27}]
[null,null,null,27,{"$f":"IF(E440=\"\",\"\",VLOOKUP(E440,Lookup!$A$2:$B$13,2,FALSE))","v":"Mar"},2048,null,null,null,null,null,null,null,null,null,null,null,null,null,null,null,null,null,null,null,null,null,null,null,null,{"$f":"IF(OR(AND(E441=\"Feb\",OR(F441=2020,OR(F441=2024,OR(F441=2028,OR(F441=2032,OR(F441=2036,F441=2040)))))),AND(E441=\"Feb\",OR(F441=2044,OR(F441=2048,F441=2052)))),29,VLOOKUP(E441,Lookup!$B$2:$C$13,2,FALSE))","v":31},0,null,null,27]
[null,null,null,27,{"$f":"IF(E441=\"\",\"\",VLOOKUP(E441,Lookup!$A$2:$B$13,2,FALSE))","v":"Apr"},2048,null,null,null,null,null,null,null,null,null,null,null,null,null,null,null,null,null,null,null,null,null,null,null,null,{"$f":"IF(OR(AND(E442=\"Feb\",OR(F442=2020,OR(F442=2024,OR(F442=2028,OR(F442=2032,OR(F442=2036,F442=2040)))))),AND(E442=\"Feb\",OR(F442=2044,OR(F442=2048,F442=2052)))),29,VLOOKUP(E442,Lookup!$B$2:$C$13,2,FALSE))","v":30},0,null,null,27]
[null,null,null,27,{"$f":"IF(E442=\"\",\"\",VLOOKUP(E442,Lookup!$A$2:$B$13,2,FALSE))","v":"May"},2048,null,null,null,null,null,null,null,null,null,null,null,null,null,null,null,null,null,null,null,null,null,null,null,null,{"$f":"IF(OR(AND(E443=\"Feb\",OR(F443=2020,OR(F443=2024,OR(F443=2028,OR(F443=2032,OR(F443=2036,F443=2040)))))),AND(E443=\"Feb\",OR(F443=2044,OR(F443=2048,F443=2052)))),29,VLOOKUP(E443,Lookup!$B$2:$C$13,2,FALSE))","v":31},0,null,null,27]
[null,null,null,27,{"$f":"IF(E443=\"\",\"\",VLOOKUP(E443,Lookup!$A$2:$B$13,2,FALSE))","v":"Jun"},2048,null,null,null,null,null,null,null,null,null,null,null,null,null,null,null,null,null,null,null,null,null,null,null,null,{"$f":"IF(OR(AND(E444=\"Feb\",OR(F444=2020,OR(F444=2024,OR(F444=2028,OR(F444=2032,OR(F444=2036,F444=2040)))))),AND(E444=\"Feb\",OR(F444=2044,OR(F444=2048,F444=2052)))),29,VLOOKUP(E444,Lookup!$B$2:$C$13,2,FALSE))","v":30},0,null,null,27]
[null,null,null,27,{"$f":"IF(E444=\"\",\"\",VLOOKUP(E444,Lookup!$A$2:$B$13,2,FALSE))","v":"Jul"},2048,null,null,null,null,null,null,null,null,null,null,null,null,null,null,null,null,null,null,null,null,null,null,null,null,{"$f":"IF(OR(AND(E445=\"Feb\",OR(F445=2020,OR(F445=2024,OR(F445=2028,OR(F445=2032,OR(F445=2036,F445=2040)))))),AND(E445=\"Feb\",OR(F445=2044,OR(F445=2048,F445=2052)))),29,VLOOKUP(E445,Lookup!$B$2:$C$13,2,FALSE))","v":31},0,null,null,27]
[null,null,null,27,{"$f":"IF(E445=\"\",\"\",VLOOKUP(E445,Lookup!$A$2:$B$13,2,FALSE))","v":"Aug"},2048,null,null,null,null,null,null,null,null,null,null,null,null,null,null,null,null,null,null,null,null,null,null,null,null,{"$f":"IF(OR(AND(E446=\"Feb\",OR(F446=2020,OR(F446=2024,OR(F446=2028,OR(F446=2032,OR(F446=2036,F446=2040)))))),AND(E446=\"Feb\",OR(F446=2044,OR(F446=2048,F446=2052)))),29,VLOOKUP(E446,Lookup!$B$2:$C$13,2,FALSE))","v":31},0,null,null,27]
[null,null,null,27,{"$f":"IF(E446=\"\",\"\",VLOOKUP(E446,Lookup!$A$2:$B$13,2,FALSE))","v":"Sep"},2048,null,null,null,null,null,null,null,null,null,null,null,null,null,null,null,null,null,null,null,null,null,null,null,null,{"$f":"IF(OR(AND(E447=\"Feb\",OR(F447=2020,OR(F447=2024,OR(F447=2028,OR(F447=2032,OR(F447=2036,F447=2040)))))),AND(E447=\"Feb\",OR(F447=2044,OR(F447=2048,F447=2052)))),29,VLOOKUP(E447,Lookup!$B$2:$C$13,2,FALSE))","v":30},{"$f":"SUM(G447:AD447)*AE447","v":0},null,null,27]
[null,null,null,27,{"$f":"IF(E447=\"\",\"\",VLOOKUP(E447,Lookup!$A$2:$B$13,2,FALSE))","v":"Oct"},2048,null,null,null,null,null,null,null,null,null,null,null,null,null,null,null,null,null,null,null,null,null,null,null,null,{"$f":"IF(OR(AND(E448=\"Feb\",OR(F448=2020,OR(F448=2024,OR(F448=2028,OR(F448=2032,OR(F448=2036,F448=2040)))))),AND(E448=\"Feb\",OR(F448=2044,OR(F448=2048,F448=2052)))),29,VLOOKUP(E448,Lookup!$B$2:$C$13,2,FALSE))","v":31},0,null,null,27]
[null,null,null,27,{"$f":"IF(E448=\"\",\"\",VLOOKUP(E448,Lookup!$A$2:$B$13,2,FALSE))","v":"Nov"},2048,null,null,null,null,null,null,null,null,null,null,null,null,null,null,null,null,null,null,null,null,null,null,null,null,{"$f":"IF(OR(AND(E449=\"Feb\",OR(F449=2020,OR(F449=2024,OR(F449=2028,OR(F449=2032,OR(F449=2036,F449=2040)))))),AND(E449=\"Feb\",OR(F449=2044,OR(F449=2048,F449=2052)))),29,VLOOKUP(E449,Lookup!$B$2:$C$13,2,FALSE))","v":30},0,null,null,27]
[null,null,null,27,{"$f":"IF(E449=\"\",\"\",VLOOKUP(E449,Lookup!$A$2:$B$13,2,FALSE))","v":"Dec"},2048,null,null,null,null,null,null,null,null,null,null,null,null,null,null,null,null,null,null,null,null,null,null,null,null,{"$f":"IF(OR(AND(E450=\"Feb\",OR(F450=2020,OR(F450=2024,OR(F450=2028,OR(F450=2032,OR(F450=2036,F450=2040)))))),AND(E450=\"Feb\",OR(F450=2044,OR(F450=2048,F450=2052)))),29,VLOOKUP(E450,Lookup!$B$2:$C$13,2,FALSE))","v":31},0,null,null,27]
[null,null,null,28,{"$f":"IF(E450=\"\",\"\",VLOOKUP(E450,Lookup!$A$2:$B$13,2,FALSE))","v":"Jan"},2049,null,null,null,null,null,null,null,null,null,null,null,null,null,null,null,null,null,null,null,null,null,null,null,null,{"$f":"IF(OR(AND(E451=\"Feb\",OR(F451=2020,OR(F451=2024,OR(F451=2028,OR(F451=2032,OR(F451=2036,F451=2040)))))),AND(E451=\"Feb\",OR(F451=2044,OR(F451=2048,F451=2052)))),29,VLOOKUP(E451,Lookup!$B$2:$C$13,2,FALSE))","v":31},0,null,null,28]
[null,null,null,28,{"$f":"IF(E451=\"\",\"\",VLOOKUP(E451,Lookup!$A$2:$B$13,2,FALSE))","v":"Feb"},2049,null,null,null,null,null,null,null,null,null,null,null,null,null,null,null,null,null,null,null,null,null,null,null,null,{"$f":"IF(OR(AND(E452=\"Feb\",OR(F452=2020,OR(F452=2024,OR(F452=2028,OR(F452=2032,OR(F452=2036,F452=2040)))))),AND(E452=\"Feb\",OR(F452=2044,OR(F452=2048,F452=2052)))),29,VLOOKUP(E452,Lookup!$B$2:$C$13,2,FALSE))","v":28},0,null,null,28]
[null,null,null,28,{"$f":"IF(E452=\"\",\"\",VLOOKUP(E452,Lookup!$A$2:$B$13,2,FALSE))","v":"Mar"},2049,null,null,null,null,null,null,null,null,null,null,null,null,null,null,null,null,null,null,null,null,null,null,null,null,{"$f":"IF(OR(AND(E453=\"Feb\",OR(F453=2020,OR(F453=2024,OR(F453=2028,OR(F453=2032,OR(F453=2036,F453=2040)))))),AND(E453=\"Feb\",OR(F453=2044,OR(F453=2048,F453=2052)))),29,VLOOKUP(E453,Lookup!$B$2:$C$13,2,FALSE))","v":31},0,null,null,28]
[null,null,null,28,{"$f":"IF(E453=\"\",\"\",VLOOKUP(E453,Lookup!$A$2:$B$13,2,FALSE))","v":"Apr"},2049,null,null,null,null,null,null,null,null,null,null,null,null,null,null,null,null,null,null,null,null,null,null,null,null,{"$f":"IF(OR(AND(E454=\"Feb\",OR(F454=2020,OR(F454=2024,OR(F454=2028,OR(F454=2032,OR(F454=2036,F454=2040)))))),AND(E454=\"Feb\",OR(F454=2044,OR(F454=2048,F454=2052)))),29,VLOOKUP(E454,Lookup!$B$2:$C$13,2,FALSE))","v":30},0,null,null,28]
[null,null,null,28,{"$f":"IF(E454=\"\",\"\",VLOOKUP(E454,Lookup!$A$2:$B$13,2,FALSE))","v":"May"},2049,null,null,null,null,null,null,null,null,null,null,null,null,null,null,null,null,null,null,null,null,null,null,null,null,{"$f":"IF(OR(AND(E455=\"Feb\",OR(F455=2020,OR(F455=2024,OR(F455=2028,OR(F455=2032,OR(F455=2036,F455=2040)))))),AND(E455=\"Feb\",OR(F455=2044,OR(F455=2048,F455=2052)))),29,VLOOKUP(E455,Lookup!$B$2:$C$13,2,FALSE))","v":31},0,null,null,28]
[null,null,null,28,{"$f":"IF(E455=\"\",\"\",VLOOKUP(E455,Lookup!$A$2:$B$13,2,FALSE))","v":"Jun"},2049,null,null,null,null,null,null,null,null,null,null,null,null,null,null,null,null,null,null,null,null,null,null,null,null,{"$f":"IF(OR(AND(E456=\"Feb\",OR(F456=2020,OR(F456=2024,OR(F456=2028,OR(F456=2032,OR(F456=2036,F456=2040)))))),AND(E456=\"Feb\",OR(F456=2044,OR(F456=2048,F456=2052)))),29,VLOOKUP(E456,Lookup!$B$2:$C$13,2,FALSE))","v":30},0,null,null,28]
[null,null,null,28,{"$f":"IF(E456=\"\",\"\",VLOOKUP(E456,Lookup!$A$2:$B$13,2,FALSE))","v":"Jul"},2049,null,null,null,null,null,null,null,null,null,null,null,null,null,null,null,null,null,null,null,null,null,null,null,null,{"$f":"IF(OR(AND(E457=\"Feb\",OR(F457=2020,OR(F457=2024,OR(F457=2028,OR(F457=2032,OR(F457=2036,F457=2040)))))),AND(E457=\"Feb\",OR(F457=2044,OR(F457=2048,F457=2052)))),29,VLOOKUP(E457,Lookup!$B$2:$C$13,2,FALSE))","v":31},0,null,null,28]
[null,null,null,28,{"$f":"IF(E457=\"\",\"\",VLOOKUP(E457,Lookup!$A$2:$B$13,2,FALSE))","v":"Aug"},2049,null,null,null,null,null,null,null,null,null,null,null,null,null,null,null,null,null,null,null,null,null,null,null,null,{"$f":"IF(OR(AND(E458=\"Feb\",OR(F458=2020,OR(F458=2024,OR(F458=2028,OR(F458=2032,OR(F458=2036,F458=2040)))))),AND(E458=\"Feb\",OR(F458=2044,OR(F458=2048,F458=2052)))),29,VLOOKUP(E458,Lookup!$B$2:$C$13,2,FALSE))","v":31},0,null,null,28]
[null,null,null,28,{"$f":"IF(E458=\"\",\"\",VLOOKUP(E458,Lookup!$A$2:$B$13,2,FALSE))","v":"Sep"},2049,null,null,null,null,null,null,null,null,null,null,null,null,null,null,null,null,null,null,null,null,null,null,null,null,{"$f":"IF(OR(AND(E459=\"Feb\",OR(F459=2020,OR(F459=2024,OR(F459=2028,OR(F459=2032,OR(F459=2036,F459=2040)))))),AND(E459=\"Feb\",OR(F459=2044,OR(F459=2048,F459=2052)))),29,VLOOKUP(E459,Lookup!$B$2:$C$13,2,FALSE))","v":30},0,null,null,28]
[null,null,null,{"$f":"+D448+1","v":28},{"$f":"IF(E459=\"\",\"\",VLOOKUP(E459,Lookup!$A$2:$B$13,2,FALSE))","v":"Oct"},2049,null,null,null,null,null,null,null,null,null,null,null,null,null,null,null,null,null,null,null,null,null,null,null,null,{"$f":"IF(OR(AND(E460=\"Feb\",OR(F460=2020,OR(F460=2024,OR(F460=2028,OR(F460=2032,OR(F460=2036,F460=2040)))))),AND(E460=\"Feb\",OR(F460=2044,OR(F460=2048,F460=2052)))),29,VLOOKUP(E460,Lookup!$B$2:$C$13,2,FALSE))","v":31},0,null,null,28]
[null,null,null,28,{"$f":"IF(E460=\"\",\"\",VLOOKUP(E460,Lookup!$A$2:$B$13,2,FALSE))","v":"Nov"},2049,null,null,null,null,null,null,null,null,null,null,null,null,null,null,null,null,null,null,null,null,null,null,null,null,{"$f":"IF(OR(AND(E461=\"Feb\",OR(F461=2020,OR(F461=2024,OR(F461=2028,OR(F461=2032,OR(F461=2036,F461=2040)))))),AND(E461=\"Feb\",OR(F461=2044,OR(F461=2048,F461=2052)))),29,VLOOKUP(E461,Lookup!$B$2:$C$13,2,FALSE))","v":30},0,null,null,28]
[null,null,null,28,{"$f":"IF(E461=\"\",\"\",VLOOKUP(E461,Lookup!$A$2:$B$13,2,FALSE))","v":"Dec"},2049,null,null,null,null,null,null,null,null,null,null,null,null,null,null,null,null,null,null,null,null,null,null,null,null,{"$f":"IF(OR(AND(E462=\"Feb\",OR(F462=2020,OR(F462=2024,OR(F462=2028,OR(F462=2032,OR(F462=2036,F462=2040)))))),AND(E462=\"Feb\",OR(F462=2044,OR(F462=2048,F462=2052)))),29,VLOOKUP(E462,Lookup!$B$2:$C$13,2,FALSE))","v":31},0,null,null,28]
[null,null,null,29,{"$f":"IF(E462=\"\",\"\",VLOOKUP(E462,Lookup!$A$2:$B$13,2,FALSE))","v":"Jan"},2050,null,null,null,null,null,null,null,null,null,null,null,null,null,null,null,null,null,null,null,null,null,null,null,null,{"$f":"IF(OR(AND(E463=\"Feb\",OR(F463=2020,OR(F463=2024,OR(F463=2028,OR(F463=2032,OR(F463=2036,F463=2040)))))),AND(E463=\"Feb\",OR(F463=2044,OR(F463=2048,F463=2052)))),29,VLOOKUP(E463,Lookup!$B$2:$C$13,2,FALSE))","v":31},0,null,null,{"$f":"+D463","v":29}]
[null,null,null,29,{"$f":"IF(E463=\"\",\"\",VLOOKUP(E463,Lookup!$A$2:$B$13,2,FALSE))","v":"Feb"},2050,null,null,null,null,null,null,null,null,null,null,null,null,null,null,null,null,null,null,null,null,null,null,null,null,{"$f":"IF(OR(AND(E464=\"Feb\",OR(F464=2020,OR(F464=2024,OR(F464=2028,OR(F464=2032,OR(F464=2036,F464=2040)))))),AND(E464=\"Feb\",OR(F464=2044,OR(F464=2048,F464=2052)))),29,VLOOKUP(E464,Lookup!$B$2:$C$13,2,FALSE))","v":28},0,null,null,{"$f":"+D464","v":29}]
[null,null,null,29,{"$f":"IF(E464=\"\",\"\",VLOOKUP(E464,Lookup!$A$2:$B$13,2,FALSE))","v":"Mar"},2050,null,null,null,null,null,null,null,null,null,null,null,null,null,null,null,null,null,null,null,null,null,null,null,null,{"$f":"IF(OR(AND(E465=\"Feb\",OR(F465=2020,OR(F465=2024,OR(F465=2028,OR(F465=2032,OR(F465=2036,F465=2040)))))),AND(E465=\"Feb\",OR(F465=2044,OR(F465=2048,F465=2052)))),29,VLOOKUP(E465,Lookup!$B$2:$C$13,2,FALSE))","v":31},0,null,null,29]
[null,null,null,29,{"$f":"IF(E465=\"\",\"\",VLOOKUP(E465,Lookup!$A$2:$B$13,2,FALSE))","v":"Apr"},2050,null,null,null,null,null,null,null,null,null,null,null,null,null,null,null,null,null,null,null,null,null,null,null,null,{"$f":"IF(OR(AND(E466=\"Feb\",OR(F466=2020,OR(F466=2024,OR(F466=2028,OR(F466=2032,OR(F466=2036,F466=2040)))))),AND(E466=\"Feb\",OR(F466=2044,OR(F466=2048,F466=2052)))),29,VLOOKUP(E466,Lookup!$B$2:$C$13,2,FALSE))","v":30},0,null,null,29]
[null,null,null,29,{"$f":"IF(E466=\"\",\"\",VLOOKUP(E466,Lookup!$A$2:$B$13,2,FALSE))","v":"May"},2050,null,null,null,null,null,null,null,null,null,null,null,null,null,null,null,null,null,null,null,null,null,null,null,null,{"$f":"IF(OR(AND(E467=\"Feb\",OR(F467=2020,OR(F467=2024,OR(F467=2028,OR(F467=2032,OR(F467=2036,F467=2040)))))),AND(E467=\"Feb\",OR(F467=2044,OR(F467=2048,F467=2052)))),29,VLOOKUP(E467,Lookup!$B$2:$C$13,2,FALSE))","v":31},0,null,null,29]
[null,null,null,29,{"$f":"IF(E467=\"\",\"\",VLOOKUP(E467,Lookup!$A$2:$B$13,2,FALSE))","v":"Jun"},2050,null,null,null,null,null,null,null,null,null,null,null,null,null,null,null,null,null,null,null,null,null,null,null,null,{"$f":"IF(OR(AND(E468=\"Feb\",OR(F468=2020,OR(F468=2024,OR(F468=2028,OR(F468=2032,OR(F468=2036,F468=2040)))))),AND(E468=\"Feb\",OR(F468=2044,OR(F468=2048,F468=2052)))),29,VLOOKUP(E468,Lookup!$B$2:$C$13,2,FALSE))","v":30},0,null,null,29]
[null,null,null,29,{"$f":"IF(E468=\"\",\"\",VLOOKUP(E468,Lookup!$A$2:$B$13,2,FALSE))","v":"Jul"},2050,null,null,null,null,null,null,null,null,null,null,null,null,null,null,null,null,null,null,null,null,null,null,null,null,{"$f":"IF(OR(AND(E469=\"Feb\",OR(F469=2020,OR(F469=2024,OR(F469=2028,OR(F469=2032,OR(F469=2036,F469=2040)))))),AND(E469=\"Feb\",OR(F469=2044,OR(F469=2048,F469=2052)))),29,VLOOKUP(E469,Lookup!$B$2:$C$13,2,FALSE))","v":31},0,null,null,29]
[null,null,null,29,{"$f":"IF(E469=\"\",\"\",VLOOKUP(E469,Lookup!$A$2:$B$13,2,FALSE))","v":"Aug"},2050,null,null,null,null,null,null,null,null,null,null,null,null,null,null,null,null,null,null,null,null,null,null,null,null,{"$f":"IF(OR(AND(E470=\"Feb\",OR(F470=2020,OR(F470=2024,OR(F470=2028,OR(F470=2032,OR(F470=2036,F470=2040)))))),AND(E470=\"Feb\",OR(F470=2044,OR(F470=2048,F470=2052)))),29,VLOOKUP(E470,Lookup!$B$2:$C$13,2,FALSE))","v":31},0,null,null,29]
[null,null,null,29,{"$f":"IF(E470=\"\",\"\",VLOOKUP(E470,Lookup!$A$2:$B$13,2,FALSE))","v":"Sep"},2050,null,null,null,null,null,null,null,null,null,null,null,null,null,null,null,null,null,null,null,null,null,null,null,null,{"$f":"IF(OR(AND(E471=\"Feb\",OR(F471=2020,OR(F471=2024,OR(F471=2028,OR(F471=2032,OR(F471=2036,F471=2040)))))),AND(E471=\"Feb\",OR(F471=2044,OR(F471=2048,F471=2052)))),29,VLOOKUP(E471,Lookup!$B$2:$C$13,2,FALSE))","v":30},0,null,null,29]
[null,null,null,29,{"$f":"IF(E471=\"\",\"\",VLOOKUP(E471,Lookup!$A$2:$B$13,2,FALSE))","v":"Oct"},2050,null,null,null,null,null,null,null,null,null,null,null,null,null,null,null,null,null,null,null,null,null,null,null,null,{"$f":"IF(OR(AND(E472=\"Feb\",OR(F472=2020,OR(F472=2024,OR(F472=2028,OR(F472=2032,OR(F472=2036,F472=2040)))))),AND(E472=\"Feb\",OR(F472=2044,OR(F472=2048,F472=2052)))),29,VLOOKUP(E472,Lookup!$B$2:$C$13,2,FALSE))","v":31},0,null,null,29]
[null,null,null,29,{"$f":"IF(E472=\"\",\"\",VLOOKUP(E472,Lookup!$A$2:$B$13,2,FALSE))","v":"Nov"},2050,null,null,null,null,null,null,null,null,null,null,null,null,null,null,null,null,null,null,null,null,null,null,null,null,{"$f":"IF(OR(AND(E473=\"Feb\",OR(F473=2020,OR(F473=2024,OR(F473=2028,OR(F473=2032,OR(F473=2036,F473=2040)))))),AND(E473=\"Feb\",OR(F473=2044,OR(F473=2048,F473=2052)))),29,VLOOKUP(E473,Lookup!$B$2:$C$13,2,FALSE))","v":30},0,null,null,29]
[null,null,null,29,{"$f":"IF(E473=\"\",\"\",VLOOKUP(E473,Lookup!$A$2:$B$13,2,FALSE))","v":"Dec"},2050,null,null,null,null,null,null,null,null,null,null,null,null,null,null,null,null,null,null,null,null,null,null,null,null,{"$f":"IF(OR(AND(E474=\"Feb\",OR(F474=2020,OR(F474=2024,OR(F474=2028,OR(F474=2032,OR(F474=2036,F474=2040)))))),AND(E474=\"Feb\",OR(F474=2044,OR(F474=2048,F474=2052)))),29,VLOOKUP(E474,Lookup!$B$2:$C$13,2,FALSE))","v":31},0,null,null,29]
[null,null,null,{"$f":"+D463+1","v":30},{"$f":"IF(E474=\"\",\"\",VLOOKUP(E474,Lookup!$A$2:$B$13,2,FALSE))","v":"Jan"},{"$f":"IF(E474=0,\"\",IF(E474=\"Dec\",F474+1,F474))","v":2051},null,null,null,null,null,null,null,null,null,null,null,null,null,null,null,null,null,null,null,null,null,null,null,null,{"$f":"IF(OR(AND(E475=\"Feb\",OR(F475=2020,OR(F475=2024,OR(F475=2028,OR(F475=2032,OR(F475=2036,F475=2040)))))),AND(E475=\"Feb\",OR(F475=2044,OR(F475=2048,F475=2052)))),29,VLOOKUP(E475,Lookup!$B$2:$C$13,2,FALSE))","v":31},0,null,null,{"$f":"+D475","v":30}]
[null,null,null,30,{"$f":"IF(E475=\"\",\"\",VLOOKUP(E475,Lookup!$A$2:$B$13,2,FALSE))","v":"Feb"},2051,null,null,null,null,null,null,null,null,null,null,null,null,null,null,null,null,null,null,null,null,null,null,null,null,{"$f":"IF(OR(AND(E476=\"Feb\",OR(F476=2020,OR(F476=2024,OR(F476=2028,OR(F476=2032,OR(F476=2036,F476=2040)))))),AND(E476=\"Feb\",OR(F476=2044,OR(F476=2048,F476=2052)))),29,VLOOKUP(E476,Lookup!$B$2:$C$13,2,FALSE))","v":28},0,null,null,30]
[null,null,null,30,{"$f":"IF(E476=\"\",\"\",VLOOKUP(E476,Lookup!$A$2:$B$13,2,FALSE))","v":"Mar"},2051,null,null,null,null,null,null,null,null,null,null,null,null,null,null,null,null,null,null,null,null,null,null,null,null,{"$f":"IF(OR(AND(E477=\"Feb\",OR(F477=2020,OR(F477=2024,OR(F477=2028,OR(F477=2032,OR(F477=2036,F477=2040)))))),AND(E477=\"Feb\",OR(F477=2044,OR(F477=2048,F477=2052)))),29,VLOOKUP(E477,Lookup!$B$2:$C$13,2,FALSE))","v":31},0,null,null,30]
[null,null,null,30,{"$f":"IF(E477=\"\",\"\",VLOOKUP(E477,Lookup!$A$2:$B$13,2,FALSE))","v":"Apr"},2051,null,null,null,null,null,null,null,null,null,null,null,null,null,null,null,null,null,null,null,null,null,null,null,null,{"$f":"IF(OR(AND(E478=\"Feb\",OR(F478=2020,OR(F478=2024,OR(F478=2028,OR(F478=2032,OR(F478=2036,F478=2040)))))),AND(E478=\"Feb\",OR(F478=2044,OR(F478=2048,F478=2052)))),29,VLOOKUP(E478,Lookup!$B$2:$C$13,2,FALSE))","v":30},0,null,null,30]
[null,null,null,30,{"$f":"IF(E478=\"\",\"\",VLOOKUP(E478,Lookup!$A$2:$B$13,2,FALSE))","v":"May"},2051,null,null,null,null,null,null,null,null,null,null,null,null,null,null,null,null,null,null,null,null,null,null,null,null,{"$f":"IF(OR(AND(E479=\"Feb\",OR(F479=2020,OR(F479=2024,OR(F479=2028,OR(F479=2032,OR(F479=2036,F479=2040)))))),AND(E479=\"Feb\",OR(F479=2044,OR(F479=2048,F479=2052)))),29,VLOOKUP(E479,Lookup!$B$2:$C$13,2,FALSE))","v":31},0,null,null,30]
[null,null,null,30,{"$f":"IF(E479=\"\",\"\",VLOOKUP(E479,Lookup!$A$2:$B$13,2,FALSE))","v":"Jun"},2051,null,null,null,null,null,null,null,null,null,null,null,null,null,null,null,null,null,null,null,null,null,null,null,null,{"$f":"IF(OR(AND(E480=\"Feb\",OR(F480=2020,OR(F480=2024,OR(F480=2028,OR(F480=2032,OR(F480=2036,F480=2040)))))),AND(E480=\"Feb\",OR(F480=2044,OR(F480=2048,F480=2052)))),29,VLOOKUP(E480,Lookup!$B$2:$C$13,2,FALSE))","v":30},0,null,null,30]
[null,null,null,30,{"$f":"IF(E480=\"\",\"\",VLOOKUP(E480,Lookup!$A$2:$B$13,2,FALSE))","v":"Jul"},2051,null,null,null,null,null,null,null,null,null,null,null,null,null,null,null,null,null,null,null,null,null,null,null,null,{"$f":"IF(OR(AND(E481=\"Feb\",OR(F481=2020,OR(F481=2024,OR(F481=2028,OR(F481=2032,OR(F481=2036,F481=2040)))))),AND(E481=\"Feb\",OR(F481=2044,OR(F481=2048,F481=2052)))),29,VLOOKUP(E481,Lookup!$B$2:$C$13,2,FALSE))","v":31},0,null,null,30]
[null,null,null,30,{"$f":"IF(E481=\"\",\"\",VLOOKUP(E481,Lookup!$A$2:$B$13,2,FALSE))","v":"Aug"},2051,null,null,null,null,null,null,null,null,null,null,null,null,null,null,null,null,null,null,null,null,null,null,null,null,{"$f":"IF(OR(AND(E482=\"Feb\",OR(F482=2020,OR(F482=2024,OR(F482=2028,OR(F482=2032,OR(F482=2036,F482=2040)))))),AND(E482=\"Feb\",OR(F482=2044,OR(F482=2048,F482=2052)))),29,VLOOKUP(E482,Lookup!$B$2:$C$13,2,FALSE))","v":31},0,null,null,30]
[null,null,null,30,{"$f":"IF(E482=\"\",\"\",VLOOKUP(E482,Lookup!$A$2:$B$13,2,FALSE))","v":"Sep"},2051,null,null,null,null,null,null,null,null,null,null,null,null,null,null,null,null,null,null,null,null,null,null,null,null,{"$f":"IF(OR(AND(E483=\"Feb\",OR(F483=2020,OR(F483=2024,OR(F483=2028,OR(F483=2032,OR(F483=2036,F483=2040)))))),AND(E483=\"Feb\",OR(F483=2044,OR(F483=2048,F483=2052)))),29,VLOOKUP(E483,Lookup!$B$2:$C$13,2,FALSE))","v":30},0,null,null,30]
[null,null,null,30,{"$f":"IF(E483=\"\",\"\",VLOOKUP(E483,Lookup!$A$2:$B$13,2,FALSE))","v":"Oct"},2051,null,null,null,null,null,null,null,null,null,null,null,null,null,null,null,null,null,null,null,null,null,null,null,null,{"$f":"IF(OR(AND(E484=\"Feb\",OR(F484=2020,OR(F484=2024,OR(F484=2028,OR(F484=2032,OR(F484=2036,F484=2040)))))),AND(E484=\"Feb\",OR(F484=2044,OR(F484=2048,F484=2052)))),29,VLOOKUP(E484,Lookup!$B$2:$C$13,2,FALSE))","v":31},0,null,null,30]
[null,null,null,30,{"$f":"IF(E484=\"\",\"\",VLOOKUP(E484,Lookup!$A$2:$B$13,2,FALSE))","v":"Nov"},2051,null,null,null,null,null,null,null,null,null,null,null,null,null,null,null,null,null,null,null,null,null,null,null,null,{"$f":"IF(OR(AND(E485=\"Feb\",OR(F485=2020,OR(F485=2024,OR(F485=2028,OR(F485=2032,OR(F485=2036,F485=2040)))))),AND(E485=\"Feb\",OR(F485=2044,OR(F485=2048,F485=2052)))),29,VLOOKUP(E485,Lookup!$B$2:$C$13,2,FALSE))","v":30},0,null,null,30]
[null,null,null,30,{"$f":"IF(E485=\"\",\"\",VLOOKUP(E485,Lookup!$A$2:$B$13,2,FALSE))","v":"Dec"},2051,null,null,null,null,null,null,null,null,null,null,null,null,null,null,null,null,null,null,null,null,null,null,null,null,{"$f":"IF(OR(AND(E486=\"Feb\",OR(F486=2020,OR(F486=2024,OR(F486=2028,OR(F486=2032,OR(F486=2036,F486=2040)))))),AND(E486=\"Feb\",OR(F486=2044,OR(F486=2048,F486=2052)))),29,VLOOKUP(E486,Lookup!$B$2:$C$13,2,FALSE))","v":31},0,null,null,30]
[]
[]
[null,null,null,null,null,null,null,"Annual Production (MWH)",null,"Guarantee Match? (9.G)",null,"Capacity Factor",null,null,null,null,"Annual Production (MWH)",null,"Guarantee Match? (9.G)",null,"Capacity Factor",null,null,null,null,null,"Annual Production (MWH)",null,"Guarantee Match? (9.G)",null,"Capacity Factor"]
[null,null,null,null,null,null,"Contract Year:  1",{"$f":"SUM(AF127:AG138)","v":0},null,{"$f":"IF(ROUND(H490,0)<>ROUND(G49,0),\"NO\",\"YES\")","v":"YES"},null,{"$f":"+H490/($L$45*24*SUM(AE127:AE138)/1000)","v":{"$error":"#DIV/0!"}},null,null,null,"Contract Year:  11",{"$f":"SUM(AF247:AG258)","v":0},null,{"$f":"IF(ROUND(Q490,0)<>ROUND(L49,0),\"NO\",\"YES\")","v":"YES"},null,{"$f":"+Q490/($L$45*24*SUM(AE247:AE258)/1000)","v":{"$error":"#DIV/0!"}},null,null,null,null,"Contract Year:  21",{"$f":"SUM(AF367:AG378)","v":0},null,{"$f":"IF(ROUND(AA490,0)<>ROUND(Q49,0),\"NO\",\"YES\")","v":"YES"},null,{"$f":"+AA490/($L$45*24*SUM(AE367:AE378)/1000)","v":{"$error":"#DIV/0!"}}]
[null,null,null,null,null,null,2,{"$f":"SUM(AF139:AG150)","v":0},null,"YES",null,{"$f":"+H491/($L$45*24*SUM(AE139:AE150)/1000)","v":{"$error":"#DIV/0!"}},null,null,null,12,{"$f":"SUM(AF259:AG270)","v":0},null,"YES",null,{"$f":"+Q491/($L$45*24*SUM(AE259:AE270)/1000)","v":{"$error":"#DIV/0!"}},null,null,null,null,22,{"$f":"SUM(AF379:AG390)","v":0},null,"YES",null,{"$f":"+AA491/($L$45*24*SUM(AE379:AE390)/1000)","v":{"$error":"#DIV/0!"}}]
[null,null,null,null,null,null,3,{"$f":"SUM(AF151:AG162)","v":0},null,"YES",null,{"$f":"+H492/($L$45*24*SUM(AE151:AE162)/1000)","v":{"$error":"#DIV/0!"}},null,null,null,13,{"$f":"SUM(AF271:AG282)","v":0},null,"YES",null,{"$f":"+Q492/($L$45*24*SUM(AE271:AE282)/1000)","v":{"$error":"#DIV/0!"}},null,null,null,null,23,{"$f":"SUM(AF391:AG402)","v":0},null,"YES",null,{"$f":"+AA492/($L$45*24*SUM(AE391:AE402)/1000)","v":{"$error":"#DIV/0!"}}]
[null,null,null,null,null,null,4,{"$f":"SUM(AF163:AG174)","v":0},null,"YES",null,{"$f":"+H493/($L$45*24*SUM(AE163:AE174)/1000)","v":{"$error":"#DIV/0!"}},null,null,null,14,{"$f":"SUM(AF283:AG294)","v":0},null,"YES",null,{"$f":"+Q493/($L$45*24*SUM(AE283:AE294)/1000)","v":{"$error":"#DIV/0!"}},null,null,null,null,24,{"$f":"SUM(AF403:AG414)","v":0},null,"YES",null,{"$f":"+AA493/($L$45*24*SUM(AE403:AE414)/1000)","v":{"$error":"#DIV/0!"}}]
[null,null,null,null,null,null,5,{"$f":"SUM(AF175:AG186)","v":0},null,"YES",null,{"$f":"+H494/($L$45*24*SUM(AE175:AE186)/1000)","v":{"$error":"#DIV/0!"}},null,null,null,15,{"$f":"SUM(AF295:AG306)","v":0},null,"YES",null,{"$f":"+Q494/($L$45*24*SUM(AE295:AE306)/1000)","v":{"$error":"#DIV/0!"}},null,null,null,null,25,{"$f":"SUM(AF415:AG426)","v":0},null,"YES",null,{"$f":"+AA494/($L$45*24*SUM(AE415:AE426)/1000)","v":{"$error":"#DIV/0!"}}]
[null,null,null,null,null,null,6,{"$f":"SUM(AF187:AG198)","v":0},null,"YES",null,{"$f":"+H495/($L$45*24*SUM(AE187:AE198)/1000)","v":{"$error":"#DIV/0!"}},null,null,null,16,{"$f":"SUM(AF307:AG318)","v":0},null,"YES",null,{"$f":"+Q495/($L$45*24*SUM(AE307:AE318)/1000)","v":{"$error":"#DIV/0!"}},null,null,null,null,26,{"$f":"SUM(AF427:AG438)","v":0},null,"YES",null,{"$f":"+AA495/($L$45*24*SUM(AE427:AE438)/1000)","v":{"$error":"#DIV/0!"}}]
[null,null,null,null,null,null,7,{"$f":"SUM(AF199:AG210)","v":0},null,"YES",null,{"$f":"+H496/($L$45*24*SUM(AE199:AE210)/1000)","v":{"$error":"#DIV/0!"}},null,null,null,17,{"$f":"SUM(AF319:AG330)","v":0},null,"YES",null,{"$f":"+Q496/($L$45*24*SUM(AE319:AE330)/1000)","v":{"$error":"#DIV/0!"}},null,null,null,null,27,{"$f":"SUM(AF439:AG450)","v":0},null,"YES",null,{"$f":"+AA496/($L$45*24*SUM(AE439:AE450)/1000)","v":{"$error":"#DIV/0!"}}]
[null,null,null,null,null,null,8,{"$f":"SUM(AF211:AG222)","v":0},null,"YES",null,{"$f":"+H497/($L$45*24*SUM(AE211:AE222)/1000)","v":{"$error":"#DIV/0!"}},null,null,null,18,{"$f":"SUM(AF331:AG342)","v":0},null,"YES",null,{"$f":"+Q497/($L$45*24*SUM(AE331:AE342)/1000)","v":{"$error":"#DIV/0!"}},null,null,null,null,28,{"$f":"SUM(AF451:AG462)","v":0},null,"YES",null,{"$f":"+AA497/($L$45*24*SUM(AE451:AE462)/1000)","v":{"$error":"#DIV/0!"}}]
[null,null,null,null,null,null,9,{"$f":"SUM(AF223:AG234)","v":0},null,"YES",null,{"$f":"+H498/($L$45*24*SUM(AE223:AE234)/1000)","v":{"$error":"#DIV/0!"}},null,null,null,19,{"$f":"SUM(AF343:AG354)","v":0},null,"YES",null,{"$f":"+Q498/($L$45*24*SUM(AE343:AE354)/1000)","v":{"$error":"#DIV/0!"}},null,null,null,null,29,{"$f":"SUM(AF463:AG474)","v":0},null,"YES",null,{"$f":"+AA498/($L$45*24*SUM(AE463:AE474)/1000)","v":{"$error":"#DIV/0!"}}]
[null,null,null,null,null,null,10,{"$f":"SUM(AF235:AG246)","v":0},null,"YES",null,{"$f":"+H499/($L$45*24*SUM(AE235:AE246)/1000)","v":{"$error":"#DIV/0!"}},null,null,null,20,{"$f":"SUM(AF355:AG366)","v":0},null,"YES",null,{"$f":"+Q499/($L$45*24*SUM(AE355:AE366)/1000)","v":{"$error":"#DIV/0!"}},null,null,null,null,30,{"$f":"SUM(AF475:AG486)","v":0},null,"YES",null,{"$f":"+AA499/($L$45*24*SUM(AE475:AE486)/1000)","v":{"$error":"#DIV/0!"}}]
[]
[]
[null,"13.",null,"Renewable Energy Project Portfolio Credit Generation Profile"]
[null,null,null,"Provide the monthly estimated net portfolio credits per hour for every hour of the day."]
[]
[]
[]
[]
[null,null,null,null,null,null,"Hour:"]
[null,null,null,"CON YR","MON","YR",0,1,2,3,4,5,6,7,8,9,10,11,12,13,14,15,16,17,18,19,20,21,22,23,"DAYS","Monthly Total MWh",null,null,"CON YR"]
[null,null,null,1,{"$f":"+E127","v":"Jan"},{"$f":"+F127","v":"2022"},null,null,null,null,null,null,null,null,null,null,null,null,null,null,null,null,null,null,null,null,null,null,null,null,{"$f":"IF(OR(AND(E510=\"Feb\",OR(F510=2020,OR(F510=2024,OR(F510=2028,OR(F510=2032,OR(F510=2036,F510=2040)))))),AND(E510=\"Feb\",OR(F510=2044,OR(F510=2048,F510=2052)))),29,VLOOKUP(E510,Lookup!$B$2:$C$13,2,FALSE))","v":31},{"$f":"SUM(G510:AD510)*AE510","v":0},null,null,{"$f":"+D510","v":1}]
[null,null,null,1,{"$f":"IF(E510=\"\",\"\",VLOOKUP(E510,Lookup!$A$2:$B$13,2,FALSE))","v":"Feb"},{"$f":"IF(E510=0,\"\",IF(E510=\"Dec\",F510+1,F510))","v":"2022"},null,null,null,null,null,null,null,null,null,null,null,null,null,null,null,null,null,null,null,null,null,null,null,null,{"$f":"IF(OR(AND(E511=\"Feb\",OR(F511=2020,OR(F511=2024,OR(F511=2028,OR(F511=2032,OR(F511=2036,F511=2040)))))),AND(E511=\"Feb\",OR(F511=2044,OR(F511=2048,F511=2052)))),29,VLOOKUP(E511,Lookup!$B$2:$C$13,2,FALSE))","v":28},0,null,null,1]
[null,null,null,1,{"$f":"IF(E511=\"\",\"\",VLOOKUP(E511,Lookup!$A$2:$B$13,2,FALSE))","v":"Mar"},"2022",null,null,null,null,null,null,null,null,null,null,null,null,null,null,null,null,null,null,null,null,null,null,null,null,{"$f":"IF(OR(AND(E512=\"Feb\",OR(F512=2020,OR(F512=2024,OR(F512=2028,OR(F512=2032,OR(F512=2036,F512=2040)))))),AND(E512=\"Feb\",OR(F512=2044,OR(F512=2048,F512=2052)))),29,VLOOKUP(E512,Lookup!$B$2:$C$13,2,FALSE))","v":31},0,null,null,1]
[null,null,null,1,{"$f":"IF(E512=\"\",\"\",VLOOKUP(E512,Lookup!$A$2:$B$13,2,FALSE))","v":"Apr"},"2022",null,null,null,null,null,null,null,null,null,null,null,null,null,null,null,null,null,null,null,null,null,null,null,null,{"$f":"IF(OR(AND(E513=\"Feb\",OR(F513=2020,OR(F513=2024,OR(F513=2028,OR(F513=2032,OR(F513=2036,F513=2040)))))),AND(E513=\"Feb\",OR(F513=2044,OR(F513=2048,F513=2052)))),29,VLOOKUP(E513,Lookup!$B$2:$C$13,2,FALSE))","v":30},0,null,null,1]
[null,null,null,1,{"$f":"IF(E513=\"\",\"\",VLOOKUP(E513,Lookup!$A$2:$B$13,2,FALSE))","v":"May"},"2022",null,null,null,null,null,null,null,null,null,null,null,null,null,null,null,null,null,null,null,null,null,null,null,null,{"$f":"IF(OR(AND(E514=\"Feb\",OR(F514=2020,OR(F514=2024,OR(F514=2028,OR(F514=2032,OR(F514=2036,F514=2040)))))),AND(E514=\"Feb\",OR(F514=2044,OR(F514=2048,F514=2052)))),29,VLOOKUP(E514,Lookup!$B$2:$C$13,2,FALSE))","v":31},0,null,null,1]
[null,null,null,1,{"$f":"IF(E514=\"\",\"\",VLOOKUP(E514,Lookup!$A$2:$B$13,2,FALSE))","v":"Jun"},"2022",null,null,null,null,null,null,null,null,null,null,null,null,null,null,null,null,null,null,null,null,null,null,null,null,{"$f":"IF(OR(AND(E515=\"Feb\",OR(F515=2020,OR(F515=2024,OR(F515=2028,OR(F515=2032,OR(F515=2036,F515=2040)))))),AND(E515=\"Feb\",OR(F515=2044,OR(F515=2048,F515=2052)))),29,VLOOKUP(E515,Lookup!$B$2:$C$13,2,FALSE))","v":30},0,null,null,1]
[null,null,null,1,{"$f":"IF(E515=\"\",\"\",VLOOKUP(E515,Lookup!$A$2:$B$13,2,FALSE))","v":"Jul"},"2022",null,null,null,null,null,null,null,null,null,null,null,null,null,null,null,null,null,null,null,null,null,null,null,null,{"$f":"IF(OR(AND(E516=\"Feb\",OR(F516=2020,OR(F516=2024,OR(F516=2028,OR(F516=2032,OR(F516=2036,F516=2040)))))),AND(E516=\"Feb\",OR(F516=2044,OR(F516=2048,F516=2052)))),29,VLOOKUP(E516,Lookup!$B$2:$C$13,2,FALSE))","v":31},0,null,null,1]
[null,null,null,1,{"$f":"IF(E516=\"\",\"\",VLOOKUP(E516,Lookup!$A$2:$B$13,2,FALSE))","v":"Aug"},"2022",null,null,null,null,null,null,null,null,null,null,null,null,null,null,null,null,null,null,null,null,null,null,null,null,{"$f":"IF(OR(AND(E517=\"Feb\",OR(F517=2020,OR(F517=2024,OR(F517=2028,OR(F517=2032,OR(F517=2036,F517=2040)))))),AND(E517=\"Feb\",OR(F517=2044,OR(F517=2048,F517=2052)))),29,VLOOKUP(E517,Lookup!$B$2:$C$13,2,FALSE))","v":31},0,null,null,1]
[null,null,null,1,{"$f":"IF(E517=\"\",\"\",VLOOKUP(E517,Lookup!$A$2:$B$13,2,FALSE))","v":"Sep"},"2022",null,null,null,null,null,null,null,null,null,null,null,null,null,null,null,null,null,null,null,null,null,null,null,null,{"$f":"IF(OR(AND(E518=\"Feb\",OR(F518=2020,OR(F518=2024,OR(F518=2028,OR(F518=2032,OR(F518=2036,F518=2040)))))),AND(E518=\"Feb\",OR(F518=2044,OR(F518=2048,F518=2052)))),29,VLOOKUP(E518,Lookup!$B$2:$C$13,2,FALSE))","v":30},0,null,null,1]
[null,null,null,1,{"$f":"IF(E518=\"\",\"\",VLOOKUP(E518,Lookup!$A$2:$B$13,2,FALSE))","v":"Oct"},"2022",null,null,null,null,null,null,null,null,null,null,null,null,null,null,null,null,null,null,null,null,null,null,null,null,{"$f":"IF(OR(AND(E519=\"Feb\",OR(F519=2020,OR(F519=2024,OR(F519=2028,OR(F519=2032,OR(F519=2036,F519=2040)))))),AND(E519=\"Feb\",OR(F519=2044,OR(F519=2048,F519=2052)))),29,VLOOKUP(E519,Lookup!$B$2:$C$13,2,FALSE))","v":31},0,null,null,1]
[null,null,null,1,{"$f":"IF(E519=\"\",\"\",VLOOKUP(E519,Lookup!$A$2:$B$13,2,FALSE))","v":"Nov"},"2022",null,null,null,null,null,null,null,null,null,null,null,null,null,null,null,null,null,null,null,null,null,null,null,null,{"$f":"IF(OR(AND(E520=\"Feb\",OR(F520=2020,OR(F520=2024,OR(F520=2028,OR(F520=2032,OR(F520=2036,F520=2040)))))),AND(E520=\"Feb\",OR(F520=2044,OR(F520=2048,F520=2052)))),29,VLOOKUP(E520,Lookup!$B$2:$C$13,2,FALSE))","v":30},0,null,null,1]
[null,null,null,1,{"$f":"IF(E520=\"\",\"\",VLOOKUP(E520,Lookup!$A$2:$B$13,2,FALSE))","v":"Dec"},"2022",null,null,null,null,null,null,null,null,null,null,null,null,null,null,null,null,null,null,null,null,null,null,null,null,{"$f":"IF(OR(AND(E521=\"Feb\",OR(F521=2020,OR(F521=2024,OR(F521=2028,OR(F521=2032,OR(F521=2036,F521=2040)))))),AND(E521=\"Feb\",OR(F521=2044,OR(F521=2048,F521=2052)))),29,VLOOKUP(E521,Lookup!$B$2:$C$13,2,FALSE))","v":31},0,null,null,1]
[null,null,null,{"$f":"+D510+1","v":2},{"$f":"IF(E521=\"\",\"\",VLOOKUP(E521,Lookup!$A$2:$B$13,2,FALSE))","v":"Jan"},2023,null,null,null,null,null,null,null,null,null,null,null,null,null,null,null,null,null,null,null,null,null,null,null,null,{"$f":"IF(OR(AND(E522=\"Feb\",OR(F522=2020,OR(F522=2024,OR(F522=2028,OR(F522=2032,OR(F522=2036,F522=2040)))))),AND(E522=\"Feb\",OR(F522=2044,OR(F522=2048,F522=2052)))),29,VLOOKUP(E522,Lookup!$B$2:$C$13,2,FALSE))","v":31},0,null,null,2]
[null,null,null,{"$f":"+D511+1","v":2},{"$f":"IF(E522=\"\",\"\",VLOOKUP(E522,Lookup!$A$2:$B$13,2,FALSE))","v":"Feb"},2023,null,null,null,null,null,null,null,null,null,null,null,null,null,null,null,null,null,null,null,null,null,null,null,null,{"$f":"IF(OR(AND(E523=\"Feb\",OR(F523=2020,OR(F523=2024,OR(F523=2028,OR(F523=2032,OR(F523=2036,F523=2040)))))),AND(E523=\"Feb\",OR(F523=2044,OR(F523=2048,F523=2052)))),29,VLOOKUP(E523,Lookup!$B$2:$C$13,2,FALSE))","v":28},0,null,null,2]
[null,null,null,2,{"$f":"IF(E523=\"\",\"\",VLOOKUP(E523,Lookup!$A$2:$B$13,2,FALSE))","v":"Mar"},2023,null,null,null,null,null,null,null,null,null,null,null,null,null,null,null,null,null,null,null,null,null,null,null,null,{"$f":"IF(OR(AND(E524=\"Feb\",OR(F524=2020,OR(F524=2024,OR(F524=2028,OR(F524=2032,OR(F524=2036,F524=2040)))))),AND(E524=\"Feb\",OR(F524=2044,OR(F524=2048,F524=2052)))),29,VLOOKUP(E524,Lookup!$B$2:$C$13,2,FALSE))","v":31},0,null,null,2]
[null,null,null,2,{"$f":"IF(E524=\"\",\"\",VLOOKUP(E524,Lookup!$A$2:$B$13,2,FALSE))","v":"Apr"},2023,null,null,null,null,null,null,null,null,null,null,null,null,null,null,null,null,null,null,null,null,null,null,null,null,{"$f":"IF(OR(AND(E525=\"Feb\",OR(F525=2020,OR(F525=2024,OR(F525=2028,OR(F525=2032,OR(F525=2036,F525=2040)))))),AND(E525=\"Feb\",OR(F525=2044,OR(F525=2048,F525=2052)))),29,VLOOKUP(E525,Lookup!$B$2:$C$13,2,FALSE))","v":30},0,null,null,2]
[null,null,null,2,{"$f":"IF(E525=\"\",\"\",VLOOKUP(E525,Lookup!$A$2:$B$13,2,FALSE))","v":"May"},2023,null,null,null,null,null,null,null,null,null,null,null,null,null,null,null,null,null,null,null,null,null,null,null,null,{"$f":"IF(OR(AND(E526=\"Feb\",OR(F526=2020,OR(F526=2024,OR(F526=2028,OR(F526=2032,OR(F526=2036,F526=2040)))))),AND(E526=\"Feb\",OR(F526=2044,OR(F526=2048,F526=2052)))),29,VLOOKUP(E526,Lookup!$B$2:$C$13,2,FALSE))","v":31},0,null,null,2]
[null,null,null,2,{"$f":"IF(E526=\"\",\"\",VLOOKUP(E526,Lookup!$A$2:$B$13,2,FALSE))","v":"Jun"},2023,null,null,null,null,null,null,null,null,null,null,null,null,null,null,null,null,null,null,null,null,null,null,null,null,{"$f":"IF(OR(AND(E527=\"Feb\",OR(F527=2020,OR(F527=2024,OR(F527=2028,OR(F527=2032,OR(F527=2036,F527=2040)))))),AND(E527=\"Feb\",OR(F527=2044,OR(F527=2048,F527=2052)))),29,VLOOKUP(E527,Lookup!$B$2:$C$13,2,FALSE))","v":30},0,null,null,2]
[null,null,null,2,{"$f":"IF(E527=\"\",\"\",VLOOKUP(E527,Lookup!$A$2:$B$13,2,FALSE))","v":"Jul"},2023,null,null,null,null,null,null,null,null,null,null,null,null,null,null,null,null,null,null,null,null,null,null,null,null,{"$f":"IF(OR(AND(E528=\"Feb\",OR(F528=2020,OR(F528=2024,OR(F528=2028,OR(F528=2032,OR(F528=2036,F528=2040)))))),AND(E528=\"Feb\",OR(F528=2044,OR(F528=2048,F528=2052)))),29,VLOOKUP(E528,Lookup!$B$2:$C$13,2,FALSE))","v":31},0,null,null,2]
[null,null,null,2,{"$f":"IF(E528=\"\",\"\",VLOOKUP(E528,Lookup!$A$2:$B$13,2,FALSE))","v":"Aug"},2023,null,null,null,null,null,null,null,null,null,null,null,null,null,null,null,null,null,null,null,null,null,null,null,null,{"$f":"IF(OR(AND(E529=\"Feb\",OR(F529=2020,OR(F529=2024,OR(F529=2028,OR(F529=2032,OR(F529=2036,F529=2040)))))),AND(E529=\"Feb\",OR(F529=2044,OR(F529=2048,F529=2052)))),29,VLOOKUP(E529,Lookup!$B$2:$C$13,2,FALSE))","v":31},0,null,null,2]
[null,null,null,2,{"$f":"IF(E529=\"\",\"\",VLOOKUP(E529,Lookup!$A$2:$B$13,2,FALSE))","v":"Sep"},2023,null,null,null,null,null,null,null,null,null,null,null,null,null,null,null,null,null,null,null,null,null,null,null,null,{"$f":"IF(OR(AND(E530=\"Feb\",OR(F530=2020,OR(F530=2024,OR(F530=2028,OR(F530=2032,OR(F530=2036,F530=2040)))))),AND(E530=\"Feb\",OR(F530=2044,OR(F530=2048,F530=2052)))),29,VLOOKUP(E530,Lookup!$B$2:$C$13,2,FALSE))","v":30},0,null,null,2]
[null,null,null,2,{"$f":"IF(E530=\"\",\"\",VLOOKUP(E530,Lookup!$A$2:$B$13,2,FALSE))","v":"Oct"},2023,null,null,null,null,null,null,null,null,null,null,null,null,null,null,null,null,null,null,null,null,null,null,null,null,{"$f":"IF(OR(AND(E531=\"Feb\",OR(F531=2020,OR(F531=2024,OR(F531=2028,OR(F531=2032,OR(F531=2036,F531=2040)))))),AND(E531=\"Feb\",OR(F531=2044,OR(F531=2048,F531=2052)))),29,VLOOKUP(E531,Lookup!$B$2:$C$13,2,FALSE))","v":31},0,null,null,2]
[null,null,null,2,{"$f":"IF(E531=\"\",\"\",VLOOKUP(E531,Lookup!$A$2:$B$13,2,FALSE))","v":"Nov"},2023,null,null,null,null,null,null,null,null,null,null,null,null,null,null,null,null,null,null,null,null,null,null,null,null,{"$f":"IF(OR(AND(E532=\"Feb\",OR(F532=2020,OR(F532=2024,OR(F532=2028,OR(F532=2032,OR(F532=2036,F532=2040)))))),AND(E532=\"Feb\",OR(F532=2044,OR(F532=2048,F532=2052)))),29,VLOOKUP(E532,Lookup!$B$2:$C$13,2,FALSE))","v":30},0,null,null,2]
[null,null,null,2,{"$f":"IF(E532=\"\",\"\",VLOOKUP(E532,Lookup!$A$2:$B$13,2,FALSE))","v":"Dec"},2023,null,null,null,null,null,null,null,null,null,null,null,null,null,null,null,null,null,null,null,null,null,null,null,null,{"$f":"IF(OR(AND(E533=\"Feb\",OR(F533=2020,OR(F533=2024,OR(F533=2028,OR(F533=2032,OR(F533=2036,F533=2040)))))),AND(E533=\"Feb\",OR(F533=2044,OR(F533=2048,F533=2052)))),29,VLOOKUP(E533,Lookup!$B$2:$C$13,2,FALSE))","v":31},0,null,null,2]
[null,null,null,3,{"$f":"IF(E533=\"\",\"\",VLOOKUP(E533,Lookup!$A$2:$B$13,2,FALSE))","v":"Jan"},2024,null,null,null,null,null,null,null,null,null,null,null,null,null,null,null,null,null,null,null,null,null,null,null,null,{"$f":"IF(OR(AND(E534=\"Feb\",OR(F534=2020,OR(F534=2024,OR(F534=2028,OR(F534=2032,OR(F534=2036,F534=2040)))))),AND(E534=\"Feb\",OR(F534=2044,OR(F534=2048,F534=2052)))),29,VLOOKUP(E534,Lookup!$B$2:$C$13,2,FALSE))","v":31},0,null,null,3]
[null,null,null,3,{"$f":"IF(E534=\"\",\"\",VLOOKUP(E534,Lookup!$A$2:$B$13,2,FALSE))","v":"Feb"},2024,null,null,null,null,null,null,null,null,null,null,null,null,null,null,null,null,null,null,null,null,null,null,null,null,{"$f":"IF(OR(AND(E535=\"Feb\",OR(F535=2020,OR(F535=2024,OR(F535=2028,OR(F535=2032,OR(F535=2036,F535=2040)))))),AND(E535=\"Feb\",OR(F535=2044,OR(F535=2048,F535=2052)))),29,VLOOKUP(E535,Lookup!$B$2:$C$13,2,FALSE))","v":29},0,null,null,3]
[null,null,null,3,{"$f":"IF(E535=\"\",\"\",VLOOKUP(E535,Lookup!$A$2:$B$13,2,FALSE))","v":"Mar"},2024,null,null,null,null,null,null,null,null,null,null,null,null,null,null,null,null,null,null,null,null,null,null,null,null,{"$f":"IF(OR(AND(E536=\"Feb\",OR(F536=2020,OR(F536=2024,OR(F536=2028,OR(F536=2032,OR(F536=2036,F536=2040)))))),AND(E536=\"Feb\",OR(F536=2044,OR(F536=2048,F536=2052)))),29,VLOOKUP(E536,Lookup!$B$2:$C$13,2,FALSE))","v":31},0,null,null,3]
[null,null,null,3,{"$f":"IF(E536=\"\",\"\",VLOOKUP(E536,Lookup!$A$2:$B$13,2,FALSE))","v":"Apr"},2024,null,null,null,null,null,null,null,null,null,null,null,null,null,null,null,null,null,null,null,null,null,null,null,null,{"$f":"IF(OR(AND(E537=\"Feb\",OR(F537=2020,OR(F537=2024,OR(F537=2028,OR(F537=2032,OR(F537=2036,F537=2040)))))),AND(E537=\"Feb\",OR(F537=2044,OR(F537=2048,F537=2052)))),29,VLOOKUP(E537,Lookup!$B$2:$C$13,2,FALSE))","v":30},0,null,null,3]
[null,null,null,3,{"$f":"IF(E537=\"\",\"\",VLOOKUP(E537,Lookup!$A$2:$B$13,2,FALSE))","v":"May"},2024,null,null,null,null,null,null,null,null,null,null,null,null,null,null,null,null,null,null,null,null,null,null,null,null,{"$f":"IF(OR(AND(E538=\"Feb\",OR(F538=2020,OR(F538=2024,OR(F538=2028,OR(F538=2032,OR(F538=2036,F538=2040)))))),AND(E538=\"Feb\",OR(F538=2044,OR(F538=2048,F538=2052)))),29,VLOOKUP(E538,Lookup!$B$2:$C$13,2,FALSE))","v":31},0,null,null,3]
[null,null,null,3,{"$f":"IF(E538=\"\",\"\",VLOOKUP(E538,Lookup!$A$2:$B$13,2,FALSE))","v":"Jun"},2024,null,null,null,null,null,null,null,null,null,null,null,null,null,null,null,null,null,null,null,null,null,null,null,null,{"$f":"IF(OR(AND(E539=\"Feb\",OR(F539=2020,OR(F539=2024,OR(F539=2028,OR(F539=2032,OR(F539=2036,F539=2040)))))),AND(E539=\"Feb\",OR(F539=2044,OR(F539=2048,F539=2052)))),29,VLOOKUP(E539,Lookup!$B$2:$C$13,2,FALSE))","v":30},0,null,null,3]
[null,null,null,3,{"$f":"IF(E539=\"\",\"\",VLOOKUP(E539,Lookup!$A$2:$B$13,2,FALSE))","v":"Jul"},2024,null,null,null,null,null,null,null,null,null,null,null,null,null,null,null,null,null,null,null,null,null,null,null,null,{"$f":"IF(OR(AND(E540=\"Feb\",OR(F540=2020,OR(F540=2024,OR(F540=2028,OR(F540=2032,OR(F540=2036,F540=2040)))))),AND(E540=\"Feb\",OR(F540=2044,OR(F540=2048,F540=2052)))),29,VLOOKUP(E540,Lookup!$B$2:$C$13,2,FALSE))","v":31},0,null,null,3]
[null,null,null,3,{"$f":"IF(E540=\"\",\"\",VLOOKUP(E540,Lookup!$A$2:$B$13,2,FALSE))","v":"Aug"},2024,null,null,null,null,null,null,null,null,null,null,null,null,null,null,null,null,null,null,null,null,null,null,null,null,{"$f":"IF(OR(AND(E541=\"Feb\",OR(F541=2020,OR(F541=2024,OR(F541=2028,OR(F541=2032,OR(F541=2036,F541=2040)))))),AND(E541=\"Feb\",OR(F541=2044,OR(F541=2048,F541=2052)))),29,VLOOKUP(E541,Lookup!$B$2:$C$13,2,FALSE))","v":31},0,null,null,3]
[null,null,null,3,{"$f":"IF(E541=\"\",\"\",VLOOKUP(E541,Lookup!$A$2:$B$13,2,FALSE))","v":"Sep"},2024,null,null,null,null,null,null,null,null,null,null,null,null,null,null,null,null,null,null,null,null,null,null,null,null,{"$f":"IF(OR(AND(E542=\"Feb\",OR(F542=2020,OR(F542=2024,OR(F542=2028,OR(F542=2032,OR(F542=2036,F542=2040)))))),AND(E542=\"Feb\",OR(F542=2044,OR(F542=2048,F542=2052)))),29,VLOOKUP(E542,Lookup!$B$2:$C$13,2,FALSE))","v":30},0,null,null,{"$f":"+D542","v":3}]
[null,null,null,3,{"$f":"IF(E542=\"\",\"\",VLOOKUP(E542,Lookup!$A$2:$B$13,2,FALSE))","v":"Oct"},2024,null,null,null,null,null,null,null,null,null,null,null,null,null,null,null,null,null,null,null,null,null,null,null,null,{"$f":"IF(OR(AND(E543=\"Feb\",OR(F543=2020,OR(F543=2024,OR(F543=2028,OR(F543=2032,OR(F543=2036,F543=2040)))))),AND(E543=\"Feb\",OR(F543=2044,OR(F543=2048,F543=2052)))),29,VLOOKUP(E543,Lookup!$B$2:$C$13,2,FALSE))","v":31},0,null,null,3]
[null,null,null,3,{"$f":"IF(E543=\"\",\"\",VLOOKUP(E543,Lookup!$A$2:$B$13,2,FALSE))","v":"Nov"},2024,null,null,null,null,null,null,null,null,null,null,null,null,null,null,null,null,null,null,null,null,null,null,null,null,{"$f":"IF(OR(AND(E544=\"Feb\",OR(F544=2020,OR(F544=2024,OR(F544=2028,OR(F544=2032,OR(F544=2036,F544=2040)))))),AND(E544=\"Feb\",OR(F544=2044,OR(F544=2048,F544=2052)))),29,VLOOKUP(E544,Lookup!$B$2:$C$13,2,FALSE))","v":30},0,null,null,3]
[null,null,null,3,{"$f":"IF(E544=\"\",\"\",VLOOKUP(E544,Lookup!$A$2:$B$13,2,FALSE))","v":"Dec"},2024,null,null,null,null,null,null,null,null,null,null,null,null,null,null,null,null,null,null,null,null,null,null,null,null,{"$f":"IF(OR(AND(E545=\"Feb\",OR(F545=2020,OR(F545=2024,OR(F545=2028,OR(F545=2032,OR(F545=2036,F545=2040)))))),AND(E545=\"Feb\",OR(F545=2044,OR(F545=2048,F545=2052)))),29,VLOOKUP(E545,Lookup!$B$2:$C$13,2,FALSE))","v":31},0,null,null,3]
[null,null,null,4,{"$f":"IF(E545=\"\",\"\",VLOOKUP(E545,Lookup!$A$2:$B$13,2,FALSE))","v":"Jan"},2025,null,null,null,null,null,null,null,null,null,null,null,null,null,null,null,null,null,null,null,null,null,null,null,null,{"$f":"IF(OR(AND(E546=\"Feb\",OR(F546=2020,OR(F546=2024,OR(F546=2028,OR(F546=2032,OR(F546=2036,F546=2040)))))),AND(E546=\"Feb\",OR(F546=2044,OR(F546=2048,F546=2052)))),29,VLOOKUP(E546,Lookup!$B$2:$C$13,2,FALSE))","v":31},0,null,null,4]
[null,null,null,4,{"$f":"IF(E546=\"\",\"\",VLOOKUP(E546,Lookup!$A$2:$B$13,2,FALSE))","v":"Feb"},2025,null,null,null,null,null,null,null,null,null,null,null,null,null,null,null,null,null,null,null,null,null,null,null,null,{"$f":"IF(OR(AND(E547=\"Feb\",OR(F547=2020,OR(F547=2024,OR(F547=2028,OR(F547=2032,OR(F547=2036,F547=2040)))))),AND(E547=\"Feb\",OR(F547=2044,OR(F547=2048,F547=2052)))),29,VLOOKUP(E547,Lookup!$B$2:$C$13,2,FALSE))","v":28},0,null,null,4]
[null,null,null,4,{"$f":"IF(E547=\"\",\"\",VLOOKUP(E547,Lookup!$A$2:$B$13,2,FALSE))","v":"Mar"},2025,null,null,null,null,null,null,null,null,null,null,null,null,null,null,null,null,null,null,null,null,null,null,null,null,{"$f":"IF(OR(AND(E548=\"Feb\",OR(F548=2020,OR(F548=2024,OR(F548=2028,OR(F548=2032,OR(F548=2036,F548=2040)))))),AND(E548=\"Feb\",OR(F548=2044,OR(F548=2048,F548=2052)))),29,VLOOKUP(E548,Lookup!$B$2:$C$13,2,FALSE))","v":31},0,null,null,4]
[null,null,null,4,{"$f":"IF(E548=\"\",\"\",VLOOKUP(E548,Lookup!$A$2:$B$13,2,FALSE))","v":"Apr"},2025,null,null,null,null,null,null,null,null,null,null,null,null,null,null,null,null,null,null,null,null,null,null,null,null,{"$f":"IF(OR(AND(E549=\"Feb\",OR(F549=2020,OR(F549=2024,OR(F549=2028,OR(F549=2032,OR(F549=2036,F549=2040)))))),AND(E549=\"Feb\",OR(F549=2044,OR(F549=2048,F549=2052)))),29,VLOOKUP(E549,Lookup!$B$2:$C$13,2,FALSE))","v":30},0,null,null,4]
[null,null,null,4,{"$f":"IF(E549=\"\",\"\",VLOOKUP(E549,Lookup!$A$2:$B$13,2,FALSE))","v":"May"},2025,null,null,null,null,null,null,null,null,null,null,null,null,null,null,null,null,null,null,null,null,null,null,null,null,{"$f":"IF(OR(AND(E550=\"Feb\",OR(F550=2020,OR(F550=2024,OR(F550=2028,OR(F550=2032,OR(F550=2036,F550=2040)))))),AND(E550=\"Feb\",OR(F550=2044,OR(F550=2048,F550=2052)))),29,VLOOKUP(E550,Lookup!$B$2:$C$13,2,FALSE))","v":31},0,null,null,4]
[null,null,null,4,{"$f":"IF(E550=\"\",\"\",VLOOKUP(E550,Lookup!$A$2:$B$13,2,FALSE))","v":"Jun"},2025,null,null,null,null,null,null,null,null,null,null,null,null,null,null,null,null,null,null,null,null,null,null,null,null,{"$f":"IF(OR(AND(E551=\"Feb\",OR(F551=2020,OR(F551=2024,OR(F551=2028,OR(F551=2032,OR(F551=2036,F551=2040)))))),AND(E551=\"Feb\",OR(F551=2044,OR(F551=2048,F551=2052)))),29,VLOOKUP(E551,Lookup!$B$2:$C$13,2,FALSE))","v":30},0,null,null,4]
[null,null,null,4,{"$f":"IF(E551=\"\",\"\",VLOOKUP(E551,Lookup!$A$2:$B$13,2,FALSE))","v":"Jul"},2025,null,null,null,null,null,null,null,null,null,null,null,null,null,null,null,null,null,null,null,null,null,null,null,null,{"$f":"IF(OR(AND(E552=\"Feb\",OR(F552=2020,OR(F552=2024,OR(F552=2028,OR(F552=2032,OR(F552=2036,F552=2040)))))),AND(E552=\"Feb\",OR(F552=2044,OR(F552=2048,F552=2052)))),29,VLOOKUP(E552,Lookup!$B$2:$C$13,2,FALSE))","v":31},0,null,null,4]
[null,null,null,4,{"$f":"IF(E552=\"\",\"\",VLOOKUP(E552,Lookup!$A$2:$B$13,2,FALSE))","v":"Aug"},2025,null,null,null,null,null,null,null,null,null,null,null,null,null,null,null,null,null,null,null,null,null,null,null,null,{"$f":"IF(OR(AND(E553=\"Feb\",OR(F553=2020,OR(F553=2024,OR(F553=2028,OR(F553=2032,OR(F553=2036,F553=2040)))))),AND(E553=\"Feb\",OR(F553=2044,OR(F553=2048,F553=2052)))),29,VLOOKUP(E553,Lookup!$B$2:$C$13,2,FALSE))","v":31},0,null,null,4]
[null,null,null,4,{"$f":"IF(E553=\"\",\"\",VLOOKUP(E553,Lookup!$A$2:$B$13,2,FALSE))","v":"Sep"},2025,null,null,null,null,null,null,null,null,null,null,null,null,null,null,null,null,null,null,null,null,null,null,null,null,{"$f":"IF(OR(AND(E554=\"Feb\",OR(F554=2020,OR(F554=2024,OR(F554=2028,OR(F554=2032,OR(F554=2036,F554=2040)))))),AND(E554=\"Feb\",OR(F554=2044,OR(F554=2048,F554=2052)))),29,VLOOKUP(E554,Lookup!$B$2:$C$13,2,FALSE))","v":30},0,null,null,4]
[null,null,null,4,{"$f":"IF(E554=\"\",\"\",VLOOKUP(E554,Lookup!$A$2:$B$13,2,FALSE))","v":"Oct"},2025,null,null,null,null,null,null,null,null,null,null,null,null,null,null,null,null,null,null,null,null,null,null,null,null,{"$f":"IF(OR(AND(E555=\"Feb\",OR(F555=2020,OR(F555=2024,OR(F555=2028,OR(F555=2032,OR(F555=2036,F555=2040)))))),AND(E555=\"Feb\",OR(F555=2044,OR(F555=2048,F555=2052)))),29,VLOOKUP(E555,Lookup!$B$2:$C$13,2,FALSE))","v":31},0,null,null,4]
[null,null,null,4,{"$f":"IF(E555=\"\",\"\",VLOOKUP(E555,Lookup!$A$2:$B$13,2,FALSE))","v":"Nov"},2025,null,null,null,null,null,null,null,null,null,null,null,null,null,null,null,null,null,null,null,null,null,null,null,null,{"$f":"IF(OR(AND(E556=\"Feb\",OR(F556=2020,OR(F556=2024,OR(F556=2028,OR(F556=2032,OR(F556=2036,F556=2040)))))),AND(E556=\"Feb\",OR(F556=2044,OR(F556=2048,F556=2052)))),29,VLOOKUP(E556,Lookup!$B$2:$C$13,2,FALSE))","v":30},0,null,null,4]
[null,null,null,4,{"$f":"IF(E556=\"\",\"\",VLOOKUP(E556,Lookup!$A$2:$B$13,2,FALSE))","v":"Dec"},2025,null,null,null,null,null,null,null,null,null,null,null,null,null,null,null,null,null,null,null,null,null,null,null,null,{"$f":"IF(OR(AND(E557=\"Feb\",OR(F557=2020,OR(F557=2024,OR(F557=2028,OR(F557=2032,OR(F557=2036,F557=2040)))))),AND(E557=\"Feb\",OR(F557=2044,OR(F557=2048,F557=2052)))),29,VLOOKUP(E557,Lookup!$B$2:$C$13,2,FALSE))","v":31},0,null,null,4]
[null,null,null,5,{"$f":"IF(E557=\"\",\"\",VLOOKUP(E557,Lookup!$A$2:$B$13,2,FALSE))","v":"Jan"},2026,null,null,null,null,null,null,null,null,null,null,null,null,null,null,null,null,null,null,null,null,null,null,null,null,{"$f":"IF(OR(AND(E558=\"Feb\",OR(F558=2020,OR(F558=2024,OR(F558=2028,OR(F558=2032,OR(F558=2036,F558=2040)))))),AND(E558=\"Feb\",OR(F558=2044,OR(F558=2048,F558=2052)))),29,VLOOKUP(E558,Lookup!$B$2:$C$13,2,FALSE))","v":31},0,null,null,5]
[null,null,null,5,{"$f":"IF(E558=\"\",\"\",VLOOKUP(E558,Lookup!$A$2:$B$13,2,FALSE))","v":"Feb"},2026,null,null,null,null,null,null,null,null,null,null,null,null,null,null,null,null,null,null,null,null,null,null,null,null,{"$f":"IF(OR(AND(E559=\"Feb\",OR(F559=2020,OR(F559=2024,OR(F559=2028,OR(F559=2032,OR(F559=2036,F559=2040)))))),AND(E559=\"Feb\",OR(F559=2044,OR(F559=2048,F559=2052)))),29,VLOOKUP(E559,Lookup!$B$2:$C$13,2,FALSE))","v":28},0,null,null,5]
[null,null,null,5,{"$f":"IF(E559=\"\",\"\",VLOOKUP(E559,Lookup!$A$2:$B$13,2,FALSE))","v":"Mar"},2026,null,null,null,null,null,null,null,null,null,null,null,null,null,null,null,null,null,null,null,null,null,null,null,null,{"$f":"IF(OR(AND(E560=\"Feb\",OR(F560=2020,OR(F560=2024,OR(F560=2028,OR(F560=2032,OR(F560=2036,F560=2040)))))),AND(E560=\"Feb\",OR(F560=2044,OR(F560=2048,F560=2052)))),29,VLOOKUP(E560,Lookup!$B$2:$C$13,2,FALSE))","v":31},0,null,null,5]
[null,null,null,5,{"$f":"IF(E560=\"\",\"\",VLOOKUP(E560,Lookup!$A$2:$B$13,2,FALSE))","v":"Apr"},2026,null,null,null,null,null,null,null,null,null,null,null,null,null,null,null,null,null,null,null,null,null,null,null,null,{"$f":"IF(OR(AND(E561=\"Feb\",OR(F561=2020,OR(F561=2024,OR(F561=2028,OR(F561=2032,OR(F561=2036,F561=2040)))))),AND(E561=\"Feb\",OR(F561=2044,OR(F561=2048,F561=2052)))),29,VLOOKUP(E561,Lookup!$B$2:$C$13,2,FALSE))","v":30},0,null,null,5]
[null,null,null,5,{"$f":"IF(E561=\"\",\"\",VLOOKUP(E561,Lookup!$A$2:$B$13,2,FALSE))","v":"May"},2026,null,null,null,null,null,null,null,null,null,null,null,null,null,null,null,null,null,null,null,null,null,null,null,null,{"$f":"IF(OR(AND(E562=\"Feb\",OR(F562=2020,OR(F562=2024,OR(F562=2028,OR(F562=2032,OR(F562=2036,F562=2040)))))),AND(E562=\"Feb\",OR(F562=2044,OR(F562=2048,F562=2052)))),29,VLOOKUP(E562,Lookup!$B$2:$C$13,2,FALSE))","v":31},0,null,null,5]
[null,null,null,5,{"$f":"IF(E562=\"\",\"\",VLOOKUP(E562,Lookup!$A$2:$B$13,2,FALSE))","v":"Jun"},2026,null,null,null,null,null,null,null,null,null,null,null,null,null,null,null,null,null,null,null,null,null,null,null,null,{"$f":"IF(OR(AND(E563=\"Feb\",OR(F563=2020,OR(F563=2024,OR(F563=2028,OR(F563=2032,OR(F563=2036,F563=2040)))))),AND(E563=\"Feb\",OR(F563=2044,OR(F563=2048,F563=2052)))),29,VLOOKUP(E563,Lookup!$B$2:$C$13,2,FALSE))","v":30},0,null,null,5]
[null,null,null,5,{"$f":"IF(E563=\"\",\"\",VLOOKUP(E563,Lookup!$A$2:$B$13,2,FALSE))","v":"Jul"},2026,null,null,null,null,null,null,null,null,null,null,null,null,null,null,null,null,null,null,null,null,null,null,null,null,{"$f":"IF(OR(AND(E564=\"Feb\",OR(F564=2020,OR(F564=2024,OR(F564=2028,OR(F564=2032,OR(F564=2036,F564=2040)))))),AND(E564=\"Feb\",OR(F564=2044,OR(F564=2048,F564=2052)))),29,VLOOKUP(E564,Lookup!$B$2:$C$13,2,FALSE))","v":31},0,null,null,5]
[null,null,null,5,{"$f":"IF(E564=\"\",\"\",VLOOKUP(E564,Lookup!$A$2:$B$13,2,FALSE))","v":"Aug"},2026,null,null,null,null,null,null,null,null,null,null,null,null,null,null,null,null,null,null,null,null,null,null,null,null,{"$f":"IF(OR(AND(E565=\"Feb\",OR(F565=2020,OR(F565=2024,OR(F565=2028,OR(F565=2032,OR(F565=2036,F565=2040)))))),AND(E565=\"Feb\",OR(F565=2044,OR(F565=2048,F565=2052)))),29,VLOOKUP(E565,Lookup!$B$2:$C$13,2,FALSE))","v":31},0,null,null,5]
[null,null,null,5,{"$f":"IF(E565=\"\",\"\",VLOOKUP(E565,Lookup!$A$2:$B$13,2,FALSE))","v":"Sep"},2026,null,null,null,null,null,null,null,null,null,null,null,null,null,null,null,null,null,null,null,null,null,null,null,null,{"$f":"IF(OR(AND(E566=\"Feb\",OR(F566=2020,OR(F566=2024,OR(F566=2028,OR(F566=2032,OR(F566=2036,F566=2040)))))),AND(E566=\"Feb\",OR(F566=2044,OR(F566=2048,F566=2052)))),29,VLOOKUP(E566,Lookup!$B$2:$C$13,2,FALSE))","v":30},0,null,null,5]
[null,null,null,5,{"$f":"IF(E566=\"\",\"\",VLOOKUP(E566,Lookup!$A$2:$B$13,2,FALSE))","v":"Oct"},2026,null,null,null,null,null,null,null,null,null,null,null,null,null,null,null,null,null,null,null,null,null,null,null,null,{"$f":"IF(OR(AND(E567=\"Feb\",OR(F567=2020,OR(F567=2024,OR(F567=2028,OR(F567=2032,OR(F567=2036,F567=2040)))))),AND(E567=\"Feb\",OR(F567=2044,OR(F567=2048,F567=2052)))),29,VLOOKUP(E567,Lookup!$B$2:$C$13,2,FALSE))","v":31},0,null,null,5]
[null,null,null,5,{"$f":"IF(E567=\"\",\"\",VLOOKUP(E567,Lookup!$A$2:$B$13,2,FALSE))","v":"Nov"},2026,null,null,null,null,null,null,null,null,null,null,null,null,null,null,null,null,null,null,null,null,null,null,null,null,{"$f":"IF(OR(AND(E568=\"Feb\",OR(F568=2020,OR(F568=2024,OR(F568=2028,OR(F568=2032,OR(F568=2036,F568=2040)))))),AND(E568=\"Feb\",OR(F568=2044,OR(F568=2048,F568=2052)))),29,VLOOKUP(E568,Lookup!$B$2:$C$13,2,FALSE))","v":30},0,null,null,5]
[null,null,null,5,{"$f":"IF(E568=\"\",\"\",VLOOKUP(E568,Lookup!$A$2:$B$13,2,FALSE))","v":"Dec"},2026,null,null,null,null,null,null,null,null,null,null,null,null,null,null,null,null,null,null,null,null,null,null,null,null,{"$f":"IF(OR(AND(E569=\"Feb\",OR(F569=2020,OR(F569=2024,OR(F569=2028,OR(F569=2032,OR(F569=2036,F569=2040)))))),AND(E569=\"Feb\",OR(F569=2044,OR(F569=2048,F569=2052)))),29,VLOOKUP(E569,Lookup!$B$2:$C$13,2,FALSE))","v":31},0,null,null,5]
[null,null,null,6,{"$f":"IF(E569=\"\",\"\",VLOOKUP(E569,Lookup!$A$2:$B$13,2,FALSE))","v":"Jan"},2027,null,null,null,null,null,null,null,null,null,null,null,null,null,null,null,null,null,null,null,null,null,null,null,null,{"$f":"IF(OR(AND(E570=\"Feb\",OR(F570=2020,OR(F570=2024,OR(F570=2028,OR(F570=2032,OR(F570=2036,F570=2040)))))),AND(E570=\"Feb\",OR(F570=2044,OR(F570=2048,F570=2052)))),29,VLOOKUP(E570,Lookup!$B$2:$C$13,2,FALSE))","v":31},0,null,null,6]
[null,null,null,6,{"$f":"IF(E570=\"\",\"\",VLOOKUP(E570,Lookup!$A$2:$B$13,2,FALSE))","v":"Feb"},2027,null,null,null,null,null,null,null,null,null,null,null,null,null,null,null,null,null,null,null,null,null,null,null,null,{"$f":"IF(OR(AND(E571=\"Feb\",OR(F571=2020,OR(F571=2024,OR(F571=2028,OR(F571=2032,OR(F571=2036,F571=2040)))))),AND(E571=\"Feb\",OR(F571=2044,OR(F571=2048,F571=2052)))),29,VLOOKUP(E571,Lookup!$B$2:$C$13,2,FALSE))","v":28},0,null,null,6]
[null,null,null,6,{"$f":"IF(E571=\"\",\"\",VLOOKUP(E571,Lookup!$A$2:$B$13,2,FALSE))","v":"Mar"},2027,null,null,null,null,null,null,null,null,null,null,null,null,null,null,null,null,null,null,null,null,null,null,null,null,{"$f":"IF(OR(AND(E572=\"Feb\",OR(F572=2020,OR(F572=2024,OR(F572=2028,OR(F572=2032,OR(F572=2036,F572=2040)))))),AND(E572=\"Feb\",OR(F572=2044,OR(F572=2048,F572=2052)))),29,VLOOKUP(E572,Lookup!$B$2:$C$13,2,FALSE))","v":31},0,null,null,6]
[null,null,null,6,{"$f":"IF(E572=\"\",\"\",VLOOKUP(E572,Lookup!$A$2:$B$13,2,FALSE))","v":"Apr"},2027,null,null,null,null,null,null,null,null,null,null,null,null,null,null,null,null,null,null,null,null,null,null,null,null,{"$f":"IF(OR(AND(E573=\"Feb\",OR(F573=2020,OR(F573=2024,OR(F573=2028,OR(F573=2032,OR(F573=2036,F573=2040)))))),AND(E573=\"Feb\",OR(F573=2044,OR(F573=2048,F573=2052)))),29,VLOOKUP(E573,Lookup!$B$2:$C$13,2,FALSE))","v":30},0,null,null,6]
[null,null,null,6,{"$f":"IF(E573=\"\",\"\",VLOOKUP(E573,Lookup!$A$2:$B$13,2,FALSE))","v":"May"},2027,null,null,null,null,null,null,null,null,null,null,null,null,null,null,null,null,null,null,null,null,null,null,null,null,{"$f":"IF(OR(AND(E574=\"Feb\",OR(F574=2020,OR(F574=2024,OR(F574=2028,OR(F574=2032,OR(F574=2036,F574=2040)))))),AND(E574=\"Feb\",OR(F574=2044,OR(F574=2048,F574=2052)))),29,VLOOKUP(E574,Lookup!$B$2:$C$13,2,FALSE))","v":31},{"$f":"SUM(G574:AD574)*AE574","v":0},null,null,{"$f":"+D574","v":6}]
[null,null,null,6,{"$f":"IF(E574=\"\",\"\",VLOOKUP(E574,Lookup!$A$2:$B$13,2,FALSE))","v":"Jun"},{"$f":"IF(E574=0,\"\",IF(E574=\"Dec\",F574+1,F574))","v":2027},null,null,null,null,null,null,null,null,null,null,null,null,null,null,null,null,null,null,null,null,null,null,null,null,{"$f":"IF(OR(AND(E575=\"Feb\",OR(F575=2020,OR(F575=2024,OR(F575=2028,OR(F575=2032,OR(F575=2036,F575=2040)))))),AND(E575=\"Feb\",OR(F575=2044,OR(F575=2048,F575=2052)))),29,VLOOKUP(E575,Lookup!$B$2:$C$13,2,FALSE))","v":30},0,null,null,6]
[null,null,null,6,{"$f":"IF(E575=\"\",\"\",VLOOKUP(E575,Lookup!$A$2:$B$13,2,FALSE))","v":"Jul"},2027,null,null,null,null,null,null,null,null,null,null,null,null,null,null,null,null,null,null,null,null,null,null,null,null,{"$f":"IF(OR(AND(E576=\"Feb\",OR(F576=2020,OR(F576=2024,OR(F576=2028,OR(F576=2032,OR(F576=2036,F576=2040)))))),AND(E576=\"Feb\",OR(F576=2044,OR(F576=2048,F576=2052)))),29,VLOOKUP(E576,Lookup!$B$2:$C$13,2,FALSE))","v":31},0,null,null,6]
[null,null,null,6,{"$f":"IF(E576=\"\",\"\",VLOOKUP(E576,Lookup!$A$2:$B$13,2,FALSE))","v":"Aug"},2027,null,null,null,null,null,null,null,null,null,null,null,null,null,null,null,null,null,null,null,null,null,null,null,null,{"$f":"IF(OR(AND(E577=\"Feb\",OR(F577=2020,OR(F577=2024,OR(F577=2028,OR(F577=2032,OR(F577=2036,F577=2040)))))),AND(E577=\"Feb\",OR(F577=2044,OR(F577=2048,F577=2052)))),29,VLOOKUP(E577,Lookup!$B$2:$C$13,2,FALSE))","v":31},0,null,null,6]
[null,null,null,6,{"$f":"IF(E577=\"\",\"\",VLOOKUP(E577,Lookup!$A$2:$B$13,2,FALSE))","v":"Sep"},2027,null,null,null,null,null,null,null,null,null,null,null,null,null,null,null,null,null,null,null,null,null,null,null,null,{"$f":"IF(OR(AND(E578=\"Feb\",OR(F578=2020,OR(F578=2024,OR(F578=2028,OR(F578=2032,OR(F578=2036,F578=2040)))))),AND(E578=\"Feb\",OR(F578=2044,OR(F578=2048,F578=2052)))),29,VLOOKUP(E578,Lookup!$B$2:$C$13,2,FALSE))","v":30},0,null,null,6]
[null,null,null,6,{"$f":"IF(E578=\"\",\"\",VLOOKUP(E578,Lookup!$A$2:$B$13,2,FALSE))","v":"Oct"},2027,null,null,null,null,null,null,null,null,null,null,null,null,null,null,null,null,null,null,null,null,null,null,null,null,{"$f":"IF(OR(AND(E579=\"Feb\",OR(F579=2020,OR(F579=2024,OR(F579=2028,OR(F579=2032,OR(F579=2036,F579=2040)))))),AND(E579=\"Feb\",OR(F579=2044,OR(F579=2048,F579=2052)))),29,VLOOKUP(E579,Lookup!$B$2:$C$13,2,FALSE))","v":31},0,null,null,6]
[null,null,null,6,{"$f":"IF(E579=\"\",\"\",VLOOKUP(E579,Lookup!$A$2:$B$13,2,FALSE))","v":"Nov"},2027,null,null,null,null,null,null,null,null,null,null,null,null,null,null,null,null,null,null,null,null,null,null,null,null,{"$f":"IF(OR(AND(E580=\"Feb\",OR(F580=2020,OR(F580=2024,OR(F580=2028,OR(F580=2032,OR(F580=2036,F580=2040)))))),AND(E580=\"Feb\",OR(F580=2044,OR(F580=2048,F580=2052)))),29,VLOOKUP(E580,Lookup!$B$2:$C$13,2,FALSE))","v":30},0,null,null,6]
[null,null,null,6,{"$f":"IF(E580=\"\",\"\",VLOOKUP(E580,Lookup!$A$2:$B$13,2,FALSE))","v":"Dec"},2027,null,null,null,null,null,null,null,null,null,null,null,null,null,null,null,null,null,null,null,null,null,null,null,null,{"$f":"IF(OR(AND(E581=\"Feb\",OR(F581=2020,OR(F581=2024,OR(F581=2028,OR(F581=2032,OR(F581=2036,F581=2040)))))),AND(E581=\"Feb\",OR(F581=2044,OR(F581=2048,F581=2052)))),29,VLOOKUP(E581,Lookup!$B$2:$C$13,2,FALSE))","v":31},0,null,null,6]
[null,null,null,7,{"$f":"IF(E581=\"\",\"\",VLOOKUP(E581,Lookup!$A$2:$B$13,2,FALSE))","v":"Jan"},2028,null,null,null,null,null,null,null,null,null,null,null,null,null,null,null,null,null,null,null,null,null,null,null,null,{"$f":"IF(OR(AND(E582=\"Feb\",OR(F582=2020,OR(F582=2024,OR(F582=2028,OR(F582=2032,OR(F582=2036,F582=2040)))))),AND(E582=\"Feb\",OR(F582=2044,OR(F582=2048,F582=2052)))),29,VLOOKUP(E582,Lookup!$B$2:$C$13,2,FALSE))","v":31},0,null,null,7]
[null,null,null,7,{"$f":"IF(E582=\"\",\"\",VLOOKUP(E582,Lookup!$A$2:$B$13,2,FALSE))","v":"Feb"},2028,null,null,null,null,null,null,null,null,null,null,null,null,null,null,null,null,null,null,null,null,null,null,null,null,{"$f":"IF(OR(AND(E583=\"Feb\",OR(F583=2020,OR(F583=2024,OR(F583=2028,OR(F583=2032,OR(F583=2036,F583=2040)))))),AND(E583=\"Feb\",OR(F583=2044,OR(F583=2048,F583=2052)))),29,VLOOKUP(E583,Lookup!$B$2:$C$13,2,FALSE))","v":29},0,null,null,{"$f":"+D583","v":7}]
[null,null,null,7,{"$f":"IF(E583=\"\",\"\",VLOOKUP(E583,Lookup!$A$2:$B$13,2,FALSE))","v":"Mar"},2028,null,null,null,null,null,null,null,null,null,null,null,null,null,null,null,null,null,null,null,null,null,null,null,null,{"$f":"IF(OR(AND(E584=\"Feb\",OR(F584=2020,OR(F584=2024,OR(F584=2028,OR(F584=2032,OR(F584=2036,F584=2040)))))),AND(E584=\"Feb\",OR(F584=2044,OR(F584=2048,F584=2052)))),29,VLOOKUP(E584,Lookup!$B$2:$C$13,2,FALSE))","v":31},0,null,null,7]
[null,null,null,7,{"$f":"IF(E584=\"\",\"\",VLOOKUP(E584,Lookup!$A$2:$B$13,2,FALSE))","v":"Apr"},2028,null,null,null,null,null,null,null,null,null,null,null,null,null,null,null,null,null,null,null,null,null,null,null,null,{"$f":"IF(OR(AND(E585=\"Feb\",OR(F585=2020,OR(F585=2024,OR(F585=2028,OR(F585=2032,OR(F585=2036,F585=2040)))))),AND(E585=\"Feb\",OR(F585=2044,OR(F585=2048,F585=2052)))),29,VLOOKUP(E585,Lookup!$B$2:$C$13,2,FALSE))","v":30},0,null,null,7]
[null,null,null,7,{"$f":"IF(E585=\"\",\"\",VLOOKUP(E585,Lookup!$A$2:$B$13,2,FALSE))","v":"May"},2028,null,null,null,null,null,null,null,null,null,null,null,null,null,null,null,null,null,null,null,null,null,null,null,null,{"$f":"IF(OR(AND(E586=\"Feb\",OR(F586=2020,OR(F586=2024,OR(F586=2028,OR(F586=2032,OR(F586=2036,F586=2040)))))),AND(E586=\"Feb\",OR(F586=2044,OR(F586=2048,F586=2052)))),29,VLOOKUP(E586,Lookup!$B$2:$C$13,2,FALSE))","v":31},0,null,null,7]
[null,null,null,{"$f":"+D575+1","v":7},{"$f":"IF(E586=\"\",\"\",VLOOKUP(E586,Lookup!$A$2:$B$13,2,FALSE))","v":"Jun"},2028,null,null,null,null,null,null,null,null,null,null,null,null,null,null,null,null,null,null,null,null,null,null,null,null,{"$f":"IF(OR(AND(E587=\"Feb\",OR(F587=2020,OR(F587=2024,OR(F587=2028,OR(F587=2032,OR(F587=2036,F587=2040)))))),AND(E587=\"Feb\",OR(F587=2044,OR(F587=2048,F587=2052)))),29,VLOOKUP(E587,Lookup!$B$2:$C$13,2,FALSE))","v":30},0,null,null,7]
[null,null,null,7,{"$f":"IF(E587=\"\",\"\",VLOOKUP(E587,Lookup!$A$2:$B$13,2,FALSE))","v":"Jul"},2028,null,null,null,null,null,null,null,null,null,null,null,null,null,null,null,null,null,null,null,null,null,null,null,null,{"$f":"IF(OR(AND(E588=\"Feb\",OR(F588=2020,OR(F588=2024,OR(F588=2028,OR(F588=2032,OR(F588=2036,F588=2040)))))),AND(E588=\"Feb\",OR(F588=2044,OR(F588=2048,F588=2052)))),29,VLOOKUP(E588,Lookup!$B$2:$C$13,2,FALSE))","v":31},0,null,null,7]
[null,null,null,7,{"$f":"IF(E588=\"\",\"\",VLOOKUP(E588,Lookup!$A$2:$B$13,2,FALSE))","v":"Aug"},2028,null,null,null,null,null,null,null,null,null,null,null,null,null,null,null,null,null,null,null,null,null,null,null,null,{"$f":"IF(OR(AND(E589=\"Feb\",OR(F589=2020,OR(F589=2024,OR(F589=2028,OR(F589=2032,OR(F589=2036,F589=2040)))))),AND(E589=\"Feb\",OR(F589=2044,OR(F589=2048,F589=2052)))),29,VLOOKUP(E589,Lookup!$B$2:$C$13,2,FALSE))","v":31},0,null,null,7]
[null,null,null,7,{"$f":"IF(E589=\"\",\"\",VLOOKUP(E589,Lookup!$A$2:$B$13,2,FALSE))","v":"Sep"},2028,null,null,null,null,null,null,null,null,null,null,null,null,null,null,null,null,null,null,null,null,null,null,null,null,{"$f":"IF(OR(AND(E590=\"Feb\",OR(F590=2020,OR(F590=2024,OR(F590=2028,OR(F590=2032,OR(F590=2036,F590=2040)))))),AND(E590=\"Feb\",OR(F590=2044,OR(F590=2048,F590=2052)))),29,VLOOKUP(E590,Lookup!$B$2:$C$13,2,FALSE))","v":30},0,null,null,7]
[null,null,null,7,{"$f":"IF(E590=\"\",\"\",VLOOKUP(E590,Lookup!$A$2:$B$13,2,FALSE))","v":"Oct"},2028,null,null,null,null,null,null,null,null,null,null,null,null,null,null,null,null,null,null,null,null,null,null,null,null,{"$f":"IF(OR(AND(E591=\"Feb\",OR(F591=2020,OR(F591=2024,OR(F591=2028,OR(F591=2032,OR(F591=2036,F591=2040)))))),AND(E591=\"Feb\",OR(F591=2044,OR(F591=2048,F591=2052)))),29,VLOOKUP(E591,Lookup!$B$2:$C$13,2,FALSE))","v":31},0,null,null,7]
[null,null,null,7,{"$f":"IF(E591=\"\",\"\",VLOOKUP(E591,Lookup!$A$2:$B$13,2,FALSE))","v":"Nov"},2028,null,null,null,null,null,null,null,null,null,null,null,null,null,null,null,null,null,null,null,null,null,null,null,null,{"$f":"IF(OR(AND(E592=\"Feb\",OR(F592=2020,OR(F592=2024,OR(F592=2028,OR(F592=2032,OR(F592=2036,F592=2040)))))),AND(E592=\"Feb\",OR(F592=2044,OR(F592=2048,F592=2052)))),29,VLOOKUP(E592,Lookup!$B$2:$C$13,2,FALSE))","v":30},0,null,null,7]
[null,null,null,7,{"$f":"IF(E592=\"\",\"\",VLOOKUP(E592,Lookup!$A$2:$B$13,2,FALSE))","v":"Dec"},2028,null,null,null,null,null,null,null,null,null,null,null,null,null,null,null,null,null,null,null,null,null,null,null,null,{"$f":"IF(OR(AND(E593=\"Feb\",OR(F593=2020,OR(F593=2024,OR(F593=2028,OR(F593=2032,OR(F593=2036,F593=2040)))))),AND(E593=\"Feb\",OR(F593=2044,OR(F593=2048,F593=2052)))),29,VLOOKUP(E593,Lookup!$B$2:$C$13,2,FALSE))","v":31},0,null,null,7]
[null,null,null,8,{"$f":"IF(E593=\"\",\"\",VLOOKUP(E593,Lookup!$A$2:$B$13,2,FALSE))","v":"Jan"},2029,null,null,null,null,null,null,null,null,null,null,null,null,null,null,null,null,null,null,null,null,null,null,null,null,{"$f":"IF(OR(AND(E594=\"Feb\",OR(F594=2020,OR(F594=2024,OR(F594=2028,OR(F594=2032,OR(F594=2036,F594=2040)))))),AND(E594=\"Feb\",OR(F594=2044,OR(F594=2048,F594=2052)))),29,VLOOKUP(E594,Lookup!$B$2:$C$13,2,FALSE))","v":31},0,null,null,8]
[null,null,null,8,{"$f":"IF(E594=\"\",\"\",VLOOKUP(E594,Lookup!$A$2:$B$13,2,FALSE))","v":"Feb"},2029,null,null,null,null,null,null,null,null,null,null,null,null,null,null,null,null,null,null,null,null,null,null,null,null,{"$f":"IF(OR(AND(E595=\"Feb\",OR(F595=2020,OR(F595=2024,OR(F595=2028,OR(F595=2032,OR(F595=2036,F595=2040)))))),AND(E595=\"Feb\",OR(F595=2044,OR(F595=2048,F595=2052)))),29,VLOOKUP(E595,Lookup!$B$2:$C$13,2,FALSE))","v":28},0,null,null,8]
[null,null,null,8,{"$f":"IF(E595=\"\",\"\",VLOOKUP(E595,Lookup!$A$2:$B$13,2,FALSE))","v":"Mar"},2029,null,null,null,null,null,null,null,null,null,null,null,null,null,null,null,null,null,null,null,null,null,null,null,null,{"$f":"IF(OR(AND(E596=\"Feb\",OR(F596=2020,OR(F596=2024,OR(F596=2028,OR(F596=2032,OR(F596=2036,F596=2040)))))),AND(E596=\"Feb\",OR(F596=2044,OR(F596=2048,F596=2052)))),29,VLOOKUP(E596,Lookup!$B$2:$C$13,2,FALSE))","v":31},0,null,null,8]
[null,null,null,8,{"$f":"IF(E596=\"\",\"\",VLOOKUP(E596,Lookup!$A$2:$B$13,2,FALSE))","v":"Apr"},2029,null,null,null,null,null,null,null,null,null,null,null,null,null,null,null,null,null,null,null,null,null,null,null,null,{"$f":"IF(OR(AND(E597=\"Feb\",OR(F597=2020,OR(F597=2024,OR(F597=2028,OR(F597=2032,OR(F597=2036,F597=2040)))))),AND(E597=\"Feb\",OR(F597=2044,OR(F597=2048,F597=2052)))),29,VLOOKUP(E597,Lookup!$B$2:$C$13,2,FALSE))","v":30},0,null,null,8]
[null,null,null,8,{"$f":"IF(E597=\"\",\"\",VLOOKUP(E597,Lookup!$A$2:$B$13,2,FALSE))","v":"May"},2029,null,null,null,null,null,null,null,null,null,null,null,null,null,null,null,null,null,null,null,null,null,null,null,null,{"$f":"IF(OR(AND(E598=\"Feb\",OR(F598=2020,OR(F598=2024,OR(F598=2028,OR(F598=2032,OR(F598=2036,F598=2040)))))),AND(E598=\"Feb\",OR(F598=2044,OR(F598=2048,F598=2052)))),29,VLOOKUP(E598,Lookup!$B$2:$C$13,2,FALSE))","v":31},0,null,null,8]
[null,null,null,8,{"$f":"IF(E598=\"\",\"\",VLOOKUP(E598,Lookup!$A$2:$B$13,2,FALSE))","v":"Jun"},2029,null,null,null,null,null,null,null,null,null,null,null,null,null,null,null,null,null,null,null,null,null,null,null,null,{"$f":"IF(OR(AND(E599=\"Feb\",OR(F599=2020,OR(F599=2024,OR(F599=2028,OR(F599=2032,OR(F599=2036,F599=2040)))))),AND(E599=\"Feb\",OR(F599=2044,OR(F599=2048,F599=2052)))),29,VLOOKUP(E599,Lookup!$B$2:$C$13,2,FALSE))","v":30},0,null,null,8]
[null,null,null,8,{"$f":"IF(E599=\"\",\"\",VLOOKUP(E599,Lookup!$A$2:$B$13,2,FALSE))","v":"Jul"},2029,null,null,null,null,null,null,null,null,null,null,null,null,null,null,null,null,null,null,null,null,null,null,null,null,{"$f":"IF(OR(AND(E600=\"Feb\",OR(F600=2020,OR(F600=2024,OR(F600=2028,OR(F600=2032,OR(F600=2036,F600=2040)))))),AND(E600=\"Feb\",OR(F600=2044,OR(F600=2048,F600=2052)))),29,VLOOKUP(E600,Lookup!$B$2:$C$13,2,FALSE))","v":31},0,null,null,8]
[null,null,null,8,{"$f":"IF(E600=\"\",\"\",VLOOKUP(E600,Lookup!$A$2:$B$13,2,FALSE))","v":"Aug"},2029,null,null,null,null,null,null,null,null,null,null,null,null,null,null,null,null,null,null,null,null,null,null,null,null,{"$f":"IF(OR(AND(E601=\"Feb\",OR(F601=2020,OR(F601=2024,OR(F601=2028,OR(F601=2032,OR(F601=2036,F601=2040)))))),AND(E601=\"Feb\",OR(F601=2044,OR(F601=2048,F601=2052)))),29,VLOOKUP(E601,Lookup!$B$2:$C$13,2,FALSE))","v":31},0,null,null,8]
[null,null,null,8,{"$f":"IF(E601=\"\",\"\",VLOOKUP(E601,Lookup!$A$2:$B$13,2,FALSE))","v":"Sep"},2029,null,null,null,null,null,null,null,null,null,null,null,null,null,null,null,null,null,null,null,null,null,null,null,null,{"$f":"IF(OR(AND(E602=\"Feb\",OR(F602=2020,OR(F602=2024,OR(F602=2028,OR(F602=2032,OR(F602=2036,F602=2040)))))),AND(E602=\"Feb\",OR(F602=2044,OR(F602=2048,F602=2052)))),29,VLOOKUP(E602,Lookup!$B$2:$C$13,2,FALSE))","v":30},0,null,null,8]
[null,null,null,8,{"$f":"IF(E602=\"\",\"\",VLOOKUP(E602,Lookup!$A$2:$B$13,2,FALSE))","v":"Oct"},2029,null,null,null,null,null,null,null,null,null,null,null,null,null,null,null,null,null,null,null,null,null,null,null,null,{"$f":"IF(OR(AND(E603=\"Feb\",OR(F603=2020,OR(F603=2024,OR(F603=2028,OR(F603=2032,OR(F603=2036,F603=2040)))))),AND(E603=\"Feb\",OR(F603=2044,OR(F603=2048,F603=2052)))),29,VLOOKUP(E603,Lookup!$B$2:$C$13,2,FALSE))","v":31},0,null,null,8]
[null,null,null,8,{"$f":"IF(E603=\"\",\"\",VLOOKUP(E603,Lookup!$A$2:$B$13,2,FALSE))","v":"Nov"},2029,null,null,null,null,null,null,null,null,null,null,null,null,null,null,null,null,null,null,null,null,null,null,null,null,{"$f":"IF(OR(AND(E604=\"Feb\",OR(F604=2020,OR(F604=2024,OR(F604=2028,OR(F604=2032,OR(F604=2036,F604=2040)))))),AND(E604=\"Feb\",OR(F604=2044,OR(F604=2048,F604=2052)))),29,VLOOKUP(E604,Lookup!$B$2:$C$13,2,FALSE))","v":30},0,null,null,8]
[null,null,null,8,{"$f":"IF(E604=\"\",\"\",VLOOKUP(E604,Lookup!$A$2:$B$13,2,FALSE))","v":"Dec"},2029,null,null,null,null,null,null,null,null,null,null,null,null,null,null,null,null,null,null,null,null,null,null,null,null,{"$f":"IF(OR(AND(E605=\"Feb\",OR(F605=2020,OR(F605=2024,OR(F605=2028,OR(F605=2032,OR(F605=2036,F605=2040)))))),AND(E605=\"Feb\",OR(F605=2044,OR(F605=2048,F605=2052)))),29,VLOOKUP(E605,Lookup!$B$2:$C$13,2,FALSE))","v":31},0,null,null,8]
[null,null,null,9,{"$f":"IF(E605=\"\",\"\",VLOOKUP(E605,Lookup!$A$2:$B$13,2,FALSE))","v":"Jan"},2030,null,null,null,null,null,null,null,null,null,null,null,null,null,null,null,null,null,null,null,null,null,null,null,null,{"$f":"IF(OR(AND(E606=\"Feb\",OR(F606=2020,OR(F606=2024,OR(F606=2028,OR(F606=2032,OR(F606=2036,F606=2040)))))),AND(E606=\"Feb\",OR(F606=2044,OR(F606=2048,F606=2052)))),29,VLOOKUP(E606,Lookup!$B$2:$C$13,2,FALSE))","v":31},0,null,null,{"$f":"+D606","v":9}]
[null,null,null,9,{"$f":"IF(E606=\"\",\"\",VLOOKUP(E606,Lookup!$A$2:$B$13,2,FALSE))","v":"Feb"},2030,null,null,null,null,null,null,null,null,null,null,null,null,null,null,null,null,null,null,null,null,null,null,null,null,{"$f":"IF(OR(AND(E607=\"Feb\",OR(F607=2020,OR(F607=2024,OR(F607=2028,OR(F607=2032,OR(F607=2036,F607=2040)))))),AND(E607=\"Feb\",OR(F607=2044,OR(F607=2048,F607=2052)))),29,VLOOKUP(E607,Lookup!$B$2:$C$13,2,FALSE))","v":28},0,null,null,{"$f":"+D607","v":9}]
[null,null,null,9,{"$f":"IF(E607=\"\",\"\",VLOOKUP(E607,Lookup!$A$2:$B$13,2,FALSE))","v":"Mar"},2030,null,null,null,null,null,null,null,null,null,null,null,null,null,null,null,null,null,null,null,null,null,null,null,null,{"$f":"IF(OR(AND(E608=\"Feb\",OR(F608=2020,OR(F608=2024,OR(F608=2028,OR(F608=2032,OR(F608=2036,F608=2040)))))),AND(E608=\"Feb\",OR(F608=2044,OR(F608=2048,F608=2052)))),29,VLOOKUP(E608,Lookup!$B$2:$C$13,2,FALSE))","v":31},0,null,null,9]
[null,null,null,9,{"$f":"IF(E608=\"\",\"\",VLOOKUP(E608,Lookup!$A$2:$B$13,2,FALSE))","v":"Apr"},2030,null,null,null,null,null,null,null,null,null,null,null,null,null,null,null,null,null,null,null,null,null,null,null,null,{"$f":"IF(OR(AND(E609=\"Feb\",OR(F609=2020,OR(F609=2024,OR(F609=2028,OR(F609=2032,OR(F609=2036,F609=2040)))))),AND(E609=\"Feb\",OR(F609=2044,OR(F609=2048,F609=2052)))),29,VLOOKUP(E609,Lookup!$B$2:$C$13,2,FALSE))","v":30},0,null,null,9]
[null,null,null,9,{"$f":"IF(E609=\"\",\"\",VLOOKUP(E609,Lookup!$A$2:$B$13,2,FALSE))","v":"May"},2030,null,null,null,null,null,null,null,null,null,null,null,null,null,null,null,null,null,null,null,null,null,null,null,null,{"$f":"IF(OR(AND(E610=\"Feb\",OR(F610=2020,OR(F610=2024,OR(F610=2028,OR(F610=2032,OR(F610=2036,F610=2040)))))),AND(E610=\"Feb\",OR(F610=2044,OR(F610=2048,F610=2052)))),29,VLOOKUP(E610,Lookup!$B$2:$C$13,2,FALSE))","v":31},0,null,null,9]
[null,null,null,9,{"$f":"IF(E610=\"\",\"\",VLOOKUP(E610,Lookup!$A$2:$B$13,2,FALSE))","v":"Jun"},2030,null,null,null,null,null,null,null,null,null,null,null,null,null,null,null,null,null,null,null,null,null,null,null,null,{"$f":"IF(OR(AND(E611=\"Feb\",OR(F611=2020,OR(F611=2024,OR(F611=2028,OR(F611=2032,OR(F611=2036,F611=2040)))))),AND(E611=\"Feb\",OR(F611=2044,OR(F611=2048,F611=2052)))),29,VLOOKUP(E611,Lookup!$B$2:$C$13,2,FALSE))","v":30},0,null,null,9]
[null,null,null,9,{"$f":"IF(E611=\"\",\"\",VLOOKUP(E611,Lookup!$A$2:$B$13,2,FALSE))","v":"Jul"},2030,null,null,null,null,null,null,null,null,null,null,null,null,null,null,null,null,null,null,null,null,null,null,null,null,{"$f":"IF(OR(AND(E612=\"Feb\",OR(F612=2020,OR(F612=2024,OR(F612=2028,OR(F612=2032,OR(F612=2036,F612=2040)))))),AND(E612=\"Feb\",OR(F612=2044,OR(F612=2048,F612=2052)))),29,VLOOKUP(E612,Lookup!$B$2:$C$13,2,FALSE))","v":31},0,null,null,9]
[null,null,null,9,{"$f":"IF(E612=\"\",\"\",VLOOKUP(E612,Lookup!$A$2:$B$13,2,FALSE))","v":"Aug"},2030,null,null,null,null,null,null,null,null,null,null,null,null,null,null,null,null,null,null,null,null,null,null,null,null,{"$f":"IF(OR(AND(E613=\"Feb\",OR(F613=2020,OR(F613=2024,OR(F613=2028,OR(F613=2032,OR(F613=2036,F613=2040)))))),AND(E613=\"Feb\",OR(F613=2044,OR(F613=2048,F613=2052)))),29,VLOOKUP(E613,Lookup!$B$2:$C$13,2,FALSE))","v":31},0,null,null,9]
[null,null,null,9,{"$f":"IF(E613=\"\",\"\",VLOOKUP(E613,Lookup!$A$2:$B$13,2,FALSE))","v":"Sep"},2030,null,null,null,null,null,null,null,null,null,null,null,null,null,null,null,null,null,null,null,null,null,null,null,null,{"$f":"IF(OR(AND(E614=\"Feb\",OR(F614=2020,OR(F614=2024,OR(F614=2028,OR(F614=2032,OR(F614=2036,F614=2040)))))),AND(E614=\"Feb\",OR(F614=2044,OR(F614=2048,F614=2052)))),29,VLOOKUP(E614,Lookup!$B$2:$C$13,2,FALSE))","v":30},0,null,null,9]
[null,null,null,9,{"$f":"IF(E614=\"\",\"\",VLOOKUP(E614,Lookup!$A$2:$B$13,2,FALSE))","v":"Oct"},2030,null,null,null,null,null,null,null,null,null,null,null,null,null,null,null,null,null,null,null,null,null,null,null,null,{"$f":"IF(OR(AND(E615=\"Feb\",OR(F615=2020,OR(F615=2024,OR(F615=2028,OR(F615=2032,OR(F615=2036,F615=2040)))))),AND(E615=\"Feb\",OR(F615=2044,OR(F615=2048,F615=2052)))),29,VLOOKUP(E615,Lookup!$B$2:$C$13,2,FALSE))","v":31},0,null,null,9]
[null,null,null,9,{"$f":"IF(E615=\"\",\"\",VLOOKUP(E615,Lookup!$A$2:$B$13,2,FALSE))","v":"Nov"},2030,null,null,null,null,null,null,null,null,null,null,null,null,null,null,null,null,null,null,null,null,null,null,null,null,{"$f":"IF(OR(AND(E616=\"Feb\",OR(F616=2020,OR(F616=2024,OR(F616=2028,OR(F616=2032,OR(F616=2036,F616=2040)))))),AND(E616=\"Feb\",OR(F616=2044,OR(F616=2048,F616=2052)))),29,VLOOKUP(E616,Lookup!$B$2:$C$13,2,FALSE))","v":30},0,null,null,9]
[null,null,null,9,{"$f":"IF(E616=\"\",\"\",VLOOKUP(E616,Lookup!$A$2:$B$13,2,FALSE))","v":"Dec"},2030,null,null,null,null,null,null,null,null,null,null,null,null,null,null,null,null,null,null,null,null,null,null,null,null,{"$f":"IF(OR(AND(E617=\"Feb\",OR(F617=2020,OR(F617=2024,OR(F617=2028,OR(F617=2032,OR(F617=2036,F617=2040)))))),AND(E617=\"Feb\",OR(F617=2044,OR(F617=2048,F617=2052)))),29,VLOOKUP(E617,Lookup!$B$2:$C$13,2,FALSE))","v":31},0,null,null,9]
[null,null,null,10,{"$f":"IF(E617=\"\",\"\",VLOOKUP(E617,Lookup!$A$2:$B$13,2,FALSE))","v":"Jan"},2031,null,null,null,null,null,null,null,null,null,null,null,null,null,null,null,null,null,null,null,null,null,null,null,null,{"$f":"IF(OR(AND(E618=\"Feb\",OR(F618=2020,OR(F618=2024,OR(F618=2028,OR(F618=2032,OR(F618=2036,F618=2040)))))),AND(E618=\"Feb\",OR(F618=2044,OR(F618=2048,F618=2052)))),29,VLOOKUP(E618,Lookup!$B$2:$C$13,2,FALSE))","v":31},0,null,null,10]
[null,null,null,10,{"$f":"IF(E618=\"\",\"\",VLOOKUP(E618,Lookup!$A$2:$B$13,2,FALSE))","v":"Feb"},2031,null,null,null,null,null,null,null,null,null,null,null,null,null,null,null,null,null,null,null,null,null,null,null,null,{"$f":"IF(OR(AND(E619=\"Feb\",OR(F619=2020,OR(F619=2024,OR(F619=2028,OR(F619=2032,OR(F619=2036,F619=2040)))))),AND(E619=\"Feb\",OR(F619=2044,OR(F619=2048,F619=2052)))),29,VLOOKUP(E619,Lookup!$B$2:$C$13,2,FALSE))","v":28},0,null,null,10]
[null,null,null,10,{"$f":"IF(E619=\"\",\"\",VLOOKUP(E619,Lookup!$A$2:$B$13,2,FALSE))","v":"Mar"},2031,null,null,null,null,null,null,null,null,null,null,null,null,null,null,null,null,null,null,null,null,null,null,null,null,{"$f":"IF(OR(AND(E620=\"Feb\",OR(F620=2020,OR(F620=2024,OR(F620=2028,OR(F620=2032,OR(F620=2036,F620=2040)))))),AND(E620=\"Feb\",OR(F620=2044,OR(F620=2048,F620=2052)))),29,VLOOKUP(E620,Lookup!$B$2:$C$13,2,FALSE))","v":31},0,null,null,10]
[null,null,null,10,{"$f":"IF(E620=\"\",\"\",VLOOKUP(E620,Lookup!$A$2:$B$13,2,FALSE))","v":"Apr"},2031,null,null,null,null,null,null,null,null,null,null,null,null,null,null,null,null,null,null,null,null,null,null,null,null,{"$f":"IF(OR(AND(E621=\"Feb\",OR(F621=2020,OR(F621=2024,OR(F621=2028,OR(F621=2032,OR(F621=2036,F621=2040)))))),AND(E621=\"Feb\",OR(F621=2044,OR(F621=2048,F621=2052)))),29,VLOOKUP(E621,Lookup!$B$2:$C$13,2,FALSE))","v":30},0,null,null,10]
[null,null,null,10,{"$f":"IF(E621=\"\",\"\",VLOOKUP(E621,Lookup!$A$2:$B$13,2,FALSE))","v":"May"},2031,null,null,null,null,null,null,null,null,null,null,null,null,null,null,null,null,null,null,null,null,null,null,null,null,{"$f":"IF(OR(AND(E622=\"Feb\",OR(F622=2020,OR(F622=2024,OR(F622=2028,OR(F622=2032,OR(F622=2036,F622=2040)))))),AND(E622=\"Feb\",OR(F622=2044,OR(F622=2048,F622=2052)))),29,VLOOKUP(E622,Lookup!$B$2:$C$13,2,FALSE))","v":31},0,null,null,10]
[null,null,null,10,{"$f":"IF(E622=\"\",\"\",VLOOKUP(E622,Lookup!$A$2:$B$13,2,FALSE))","v":"Jun"},2031,null,null,null,null,null,null,null,null,null,null,null,null,null,null,null,null,null,null,null,null,null,null,null,null,{"$f":"IF(OR(AND(E623=\"Feb\",OR(F623=2020,OR(F623=2024,OR(F623=2028,OR(F623=2032,OR(F623=2036,F623=2040)))))),AND(E623=\"Feb\",OR(F623=2044,OR(F623=2048,F623=2052)))),29,VLOOKUP(E623,Lookup!$B$2:$C$13,2,FALSE))","v":30},0,null,null,10]
[null,null,null,10,{"$f":"IF(E623=\"\",\"\",VLOOKUP(E623,Lookup!$A$2:$B$13,2,FALSE))","v":"Jul"},2031,null,null,null,null,null,null,null,null,null,null,null,null,null,null,null,null,null,null,null,null,null,null,null,null,{"$f":"IF(OR(AND(E624=\"Feb\",OR(F624=2020,OR(F624=2024,OR(F624=2028,OR(F624=2032,OR(F624=2036,F624=2040)))))),AND(E624=\"Feb\",OR(F624=2044,OR(F624=2048,F624=2052)))),29,VLOOKUP(E624,Lookup!$B$2:$C$13,2,FALSE))","v":31},0,null,null,10]
[null,null,null,10,{"$f":"IF(E624=\"\",\"\",VLOOKUP(E624,Lookup!$A$2:$B$13,2,FALSE))","v":"Aug"},2031,null,null,null,null,null,null,null,null,null,null,null,null,null,null,null,null,null,null,null,null,null,null,null,null,{"$f":"IF(OR(AND(E625=\"Feb\",OR(F625=2020,OR(F625=2024,OR(F625=2028,OR(F625=2032,OR(F625=2036,F625=2040)))))),AND(E625=\"Feb\",OR(F625=2044,OR(F625=2048,F625=2052)))),29,VLOOKUP(E625,Lookup!$B$2:$C$13,2,FALSE))","v":31},0,null,null,10]
[null,null,null,10,{"$f":"IF(E625=\"\",\"\",VLOOKUP(E625,Lookup!$A$2:$B$13,2,FALSE))","v":"Sep"},2031,null,null,null,null,null,null,null,null,null,null,null,null,null,null,null,null,null,null,null,null,null,null,null,null,{"$f":"IF(OR(AND(E626=\"Feb\",OR(F626=2020,OR(F626=2024,OR(F626=2028,OR(F626=2032,OR(F626=2036,F626=2040)))))),AND(E626=\"Feb\",OR(F626=2044,OR(F626=2048,F626=2052)))),29,VLOOKUP(E626,Lookup!$B$2:$C$13,2,FALSE))","v":30},0,null,null,10]
[null,null,null,10,{"$f":"IF(E626=\"\",\"\",VLOOKUP(E626,Lookup!$A$2:$B$13,2,FALSE))","v":"Oct"},2031,null,null,null,null,null,null,null,null,null,null,null,null,null,null,null,null,null,null,null,null,null,null,null,null,{"$f":"IF(OR(AND(E627=\"Feb\",OR(F627=2020,OR(F627=2024,OR(F627=2028,OR(F627=2032,OR(F627=2036,F627=2040)))))),AND(E627=\"Feb\",OR(F627=2044,OR(F627=2048,F627=2052)))),29,VLOOKUP(E627,Lookup!$B$2:$C$13,2,FALSE))","v":31},0,null,null,10]
[null,null,null,10,{"$f":"IF(E627=\"\",\"\",VLOOKUP(E627,Lookup!$A$2:$B$13,2,FALSE))","v":"Nov"},2031,null,null,null,null,null,null,null,null,null,null,null,null,null,null,null,null,null,null,null,null,null,null,null,null,{"$f":"IF(OR(AND(E628=\"Feb\",OR(F628=2020,OR(F628=2024,OR(F628=2028,OR(F628=2032,OR(F628=2036,F628=2040)))))),AND(E628=\"Feb\",OR(F628=2044,OR(F628=2048,F628=2052)))),29,VLOOKUP(E628,Lookup!$B$2:$C$13,2,FALSE))","v":30},0,null,null,10]
[null,null,null,10,{"$f":"IF(E628=\"\",\"\",VLOOKUP(E628,Lookup!$A$2:$B$13,2,FALSE))","v":"Dec"},2031,null,null,null,null,null,null,null,null,null,null,null,null,null,null,null,null,null,null,null,null,null,null,null,null,{"$f":"IF(OR(AND(E629=\"Feb\",OR(F629=2020,OR(F629=2024,OR(F629=2028,OR(F629=2032,OR(F629=2036,F629=2040)))))),AND(E629=\"Feb\",OR(F629=2044,OR(F629=2048,F629=2052)))),29,VLOOKUP(E629,Lookup!$B$2:$C$13,2,FALSE))","v":31},0,null,null,10]
[null,null,null,11,{"$f":"IF(E629=\"\",\"\",VLOOKUP(E629,Lookup!$A$2:$B$13,2,FALSE))","v":"Jan"},2032,null,null,null,null,null,null,null,null,null,null,null,null,null,null,null,null,null,null,null,null,null,null,null,null,{"$f":"IF(OR(AND(E630=\"Feb\",OR(F630=2020,OR(F630=2024,OR(F630=2028,OR(F630=2032,OR(F630=2036,F630=2040)))))),AND(E630=\"Feb\",OR(F630=2044,OR(F630=2048,F630=2052)))),29,VLOOKUP(E630,Lookup!$B$2:$C$13,2,FALSE))","v":31},0,null,null,{"$f":"+D630","v":11}]
[null,null,null,11,{"$f":"IF(E630=\"\",\"\",VLOOKUP(E630,Lookup!$A$2:$B$13,2,FALSE))","v":"Feb"},2032,null,null,null,null,null,null,null,null,null,null,null,null,null,null,null,null,null,null,null,null,null,null,null,null,{"$f":"IF(OR(AND(E631=\"Feb\",OR(F631=2020,OR(F631=2024,OR(F631=2028,OR(F631=2032,OR(F631=2036,F631=2040)))))),AND(E631=\"Feb\",OR(F631=2044,OR(F631=2048,F631=2052)))),29,VLOOKUP(E631,Lookup!$B$2:$C$13,2,FALSE))","v":29},0,null,null,{"$f":"+D631","v":11}]
[null,null,null,11,{"$f":"IF(E631=\"\",\"\",VLOOKUP(E631,Lookup!$A$2:$B$13,2,FALSE))","v":"Mar"},2032,null,null,null,null,null,null,null,null,null,null,null,null,null,null,null,null,null,null,null,null,null,null,null,null,{"$f":"IF(OR(AND(E632=\"Feb\",OR(F632=2020,OR(F632=2024,OR(F632=2028,OR(F632=2032,OR(F632=2036,F632=2040)))))),AND(E632=\"Feb\",OR(F632=2044,OR(F632=2048,F632=2052)))),29,VLOOKUP(E632,Lookup!$B$2:$C$13,2,FALSE))","v":31},0,null,null,11]
[null,null,null,11,{"$f":"IF(E632=\"\",\"\",VLOOKUP(E632,Lookup!$A$2:$B$13,2,FALSE))","v":"Apr"},2032,null,null,null,null,null,null,null,null,null,null,null,null,null,null,null,null,null,null,null,null,null,null,null,null,{"$f":"IF(OR(AND(E633=\"Feb\",OR(F633=2020,OR(F633=2024,OR(F633=2028,OR(F633=2032,OR(F633=2036,F633=2040)))))),AND(E633=\"Feb\",OR(F633=2044,OR(F633=2048,F633=2052)))),29,VLOOKUP(E633,Lookup!$B$2:$C$13,2,FALSE))","v":30},0,null,null,11]
[null,null,null,11,{"$f":"IF(E633=\"\",\"\",VLOOKUP(E633,Lookup!$A$2:$B$13,2,FALSE))","v":"May"},2032,null,null,null,null,null,null,null,null,null,null,null,null,null,null,null,null,null,null,null,null,null,null,null,null,{"$f":"IF(OR(AND(E634=\"Feb\",OR(F634=2020,OR(F634=2024,OR(F634=2028,OR(F634=2032,OR(F634=2036,F634=2040)))))),AND(E634=\"Feb\",OR(F634=2044,OR(F634=2048,F634=2052)))),29,VLOOKUP(E634,Lookup!$B$2:$C$13,2,FALSE))","v":31},0,null,null,11]
[null,null,null,11,{"$f":"IF(E634=\"\",\"\",VLOOKUP(E634,Lookup!$A$2:$B$13,2,FALSE))","v":"Jun"},2032,null,null,null,null,null,null,null,null,null,null,null,null,null,null,null,null,null,null,null,null,null,null,null,null,{"$f":"IF(OR(AND(E635=\"Feb\",OR(F635=2020,OR(F635=2024,OR(F635=2028,OR(F635=2032,OR(F635=2036,F635=2040)))))),AND(E635=\"Feb\",OR(F635=2044,OR(F635=2048,F635=2052)))),29,VLOOKUP(E635,Lookup!$B$2:$C$13,2,FALSE))","v":30},0,null,null,11]
[null,null,null,11,{"$f":"IF(E635=\"\",\"\",VLOOKUP(E635,Lookup!$A$2:$B$13,2,FALSE))","v":"Jul"},2032,null,null,null,null,null,null,null,null,null,null,null,null,null,null,null,null,null,null,null,null,null,null,null,null,{"$f":"IF(OR(AND(E636=\"Feb\",OR(F636=2020,OR(F636=2024,OR(F636=2028,OR(F636=2032,OR(F636=2036,F636=2040)))))),AND(E636=\"Feb\",OR(F636=2044,OR(F636=2048,F636=2052)))),29,VLOOKUP(E636,Lookup!$B$2:$C$13,2,FALSE))","v":31},0,null,null,11]
[null,null,null,11,{"$f":"IF(E636=\"\",\"\",VLOOKUP(E636,Lookup!$A$2:$B$13,2,FALSE))","v":"Aug"},2032,null,null,null,null,null,null,null,null,null,null,null,null,null,null,null,null,null,null,null,null,null,null,null,null,{"$f":"IF(OR(AND(E637=\"Feb\",OR(F637=2020,OR(F637=2024,OR(F637=2028,OR(F637=2032,OR(F637=2036,F637=2040)))))),AND(E637=\"Feb\",OR(F637=2044,OR(F637=2048,F637=2052)))),29,VLOOKUP(E637,Lookup!$B$2:$C$13,2,FALSE))","v":31},0,null,null,11]
[null,null,null,11,{"$f":"IF(E637=\"\",\"\",VLOOKUP(E637,Lookup!$A$2:$B$13,2,FALSE))","v":"Sep"},2032,null,null,null,null,null,null,null,null,null,null,null,null,null,null,null,null,null,null,null,null,null,null,null,null,{"$f":"IF(OR(AND(E638=\"Feb\",OR(F638=2020,OR(F638=2024,OR(F638=2028,OR(F638=2032,OR(F638=2036,F638=2040)))))),AND(E638=\"Feb\",OR(F638=2044,OR(F638=2048,F638=2052)))),29,VLOOKUP(E638,Lookup!$B$2:$C$13,2,FALSE))","v":30},{"$f":"SUM(G638:AD638)*AE638","v":0},null,null,11]
[null,null,null,11,{"$f":"IF(E638=\"\",\"\",VLOOKUP(E638,Lookup!$A$2:$B$13,2,FALSE))","v":"Oct"},{"$f":"IF(E638=0,\"\",IF(E638=\"Dec\",F638+1,F638))","v":2032},null,null,null,null,null,null,null,null,null,null,null,null,null,null,null,null,null,null,null,null,null,null,null,null,{"$f":"IF(OR(AND(E639=\"Feb\",OR(F639=2020,OR(F639=2024,OR(F639=2028,OR(F639=2032,OR(F639=2036,F639=2040)))))),AND(E639=\"Feb\",OR(F639=2044,OR(F639=2048,F639=2052)))),29,VLOOKUP(E639,Lookup!$B$2:$C$13,2,FALSE))","v":31},0,null,null,11]
[null,null,null,11,{"$f":"IF(E639=\"\",\"\",VLOOKUP(E639,Lookup!$A$2:$B$13,2,FALSE))","v":"Nov"},2032,null,null,null,null,null,null,null,null,null,null,null,null,null,null,null,null,null,null,null,null,null,null,null,null,{"$f":"IF(OR(AND(E640=\"Feb\",OR(F640=2020,OR(F640=2024,OR(F640=2028,OR(F640=2032,OR(F640=2036,F640=2040)))))),AND(E640=\"Feb\",OR(F640=2044,OR(F640=2048,F640=2052)))),29,VLOOKUP(E640,Lookup!$B$2:$C$13,2,FALSE))","v":30},0,null,null,11]
[null,null,null,11,{"$f":"IF(E640=\"\",\"\",VLOOKUP(E640,Lookup!$A$2:$B$13,2,FALSE))","v":"Dec"},2032,null,null,null,null,null,null,null,null,null,null,null,null,null,null,null,null,null,null,null,null,null,null,null,null,{"$f":"IF(OR(AND(E641=\"Feb\",OR(F641=2020,OR(F641=2024,OR(F641=2028,OR(F641=2032,OR(F641=2036,F641=2040)))))),AND(E641=\"Feb\",OR(F641=2044,OR(F641=2048,F641=2052)))),29,VLOOKUP(E641,Lookup!$B$2:$C$13,2,FALSE))","v":31},0,null,null,11]
[null,null,null,12,{"$f":"IF(E641=\"\",\"\",VLOOKUP(E641,Lookup!$A$2:$B$13,2,FALSE))","v":"Jan"},2033,null,null,null,null,null,null,null,null,null,null,null,null,null,null,null,null,null,null,null,null,null,null,null,null,{"$f":"IF(OR(AND(E642=\"Feb\",OR(F642=2020,OR(F642=2024,OR(F642=2028,OR(F642=2032,OR(F642=2036,F642=2040)))))),AND(E642=\"Feb\",OR(F642=2044,OR(F642=2048,F642=2052)))),29,VLOOKUP(E642,Lookup!$B$2:$C$13,2,FALSE))","v":31},0,null,null,12]
[null,null,null,12,{"$f":"IF(E642=\"\",\"\",VLOOKUP(E642,Lookup!$A$2:$B$13,2,FALSE))","v":"Feb"},2033,null,null,null,null,null,null,null,null,null,null,null,null,null,null,null,null,null,null,null,null,null,null,null,null,{"$f":"IF(OR(AND(E643=\"Feb\",OR(F643=2020,OR(F643=2024,OR(F643=2028,OR(F643=2032,OR(F643=2036,F643=2040)))))),AND(E643=\"Feb\",OR(F643=2044,OR(F643=2048,F643=2052)))),29,VLOOKUP(E643,Lookup!$B$2:$C$13,2,FALSE))","v":28},0,null,null,12]
[null,null,null,12,{"$f":"IF(E643=\"\",\"\",VLOOKUP(E643,Lookup!$A$2:$B$13,2,FALSE))","v":"Mar"},2033,null,null,null,null,null,null,null,null,null,null,null,null,null,null,null,null,null,null,null,null,null,null,null,null,{"$f":"IF(OR(AND(E644=\"Feb\",OR(F644=2020,OR(F644=2024,OR(F644=2028,OR(F644=2032,OR(F644=2036,F644=2040)))))),AND(E644=\"Feb\",OR(F644=2044,OR(F644=2048,F644=2052)))),29,VLOOKUP(E644,Lookup!$B$2:$C$13,2,FALSE))","v":31},0,null,null,12]
[null,null,null,12,{"$f":"IF(E644=\"\",\"\",VLOOKUP(E644,Lookup!$A$2:$B$13,2,FALSE))","v":"Apr"},2033,null,null,null,null,null,null,null,null,null,null,null,null,null,null,null,null,null,null,null,null,null,null,null,null,{"$f":"IF(OR(AND(E645=\"Feb\",OR(F645=2020,OR(F645=2024,OR(F645=2028,OR(F645=2032,OR(F645=2036,F645=2040)))))),AND(E645=\"Feb\",OR(F645=2044,OR(F645=2048,F645=2052)))),29,VLOOKUP(E645,Lookup!$B$2:$C$13,2,FALSE))","v":30},0,null,null,12]
[null,null,null,12,{"$f":"IF(E645=\"\",\"\",VLOOKUP(E645,Lookup!$A$2:$B$13,2,FALSE))","v":"May"},2033,null,null,null,null,null,null,null,null,null,null,null,null,null,null,null,null,null,null,null,null,null,null,null,null,{"$f":"IF(OR(AND(E646=\"Feb\",OR(F646=2020,OR(F646=2024,OR(F646=2028,OR(F646=2032,OR(F646=2036,F646=2040)))))),AND(E646=\"Feb\",OR(F646=2044,OR(F646=2048,F646=2052)))),29,VLOOKUP(E646,Lookup!$B$2:$C$13,2,FALSE))","v":31},0,null,null,12]
[null,null,null,12,{"$f":"IF(E646=\"\",\"\",VLOOKUP(E646,Lookup!$A$2:$B$13,2,FALSE))","v":"Jun"},2033,null,null,null,null,null,null,null,null,null,null,null,null,null,null,null,null,null,null,null,null,null,null,null,null,{"$f":"IF(OR(AND(E647=\"Feb\",OR(F647=2020,OR(F647=2024,OR(F647=2028,OR(F647=2032,OR(F647=2036,F647=2040)))))),AND(E647=\"Feb\",OR(F647=2044,OR(F647=2048,F647=2052)))),29,VLOOKUP(E647,Lookup!$B$2:$C$13,2,FALSE))","v":30},0,null,null,12]
[null,null,null,12,{"$f":"IF(E647=\"\",\"\",VLOOKUP(E647,Lookup!$A$2:$B$13,2,FALSE))","v":"Jul"},2033,null,null,null,null,null,null,null,null,null,null,null,null,null,null,null,null,null,null,null,null,null,null,null,null,{"$f":"IF(OR(AND(E648=\"Feb\",OR(F648=2020,OR(F648=2024,OR(F648=2028,OR(F648=2032,OR(F648=2036,F648=2040)))))),AND(E648=\"Feb\",OR(F648=2044,OR(F648=2048,F648=2052)))),29,VLOOKUP(E648,Lookup!$B$2:$C$13,2,FALSE))","v":31},0,null,null,12]
[null,null,null,12,{"$f":"IF(E648=\"\",\"\",VLOOKUP(E648,Lookup!$A$2:$B$13,2,FALSE))","v":"Aug"},2033,null,null,null,null,null,null,null,null,null,null,null,null,null,null,null,null,null,null,null,null,null,null,null,null,{"$f":"IF(OR(AND(E649=\"Feb\",OR(F649=2020,OR(F649=2024,OR(F649=2028,OR(F649=2032,OR(F649=2036,F649=2040)))))),AND(E649=\"Feb\",OR(F649=2044,OR(F649=2048,F649=2052)))),29,VLOOKUP(E649,Lookup!$B$2:$C$13,2,FALSE))","v":31},0,null,null,12]
[null,null,null,12,{"$f":"IF(E649=\"\",\"\",VLOOKUP(E649,Lookup!$A$2:$B$13,2,FALSE))","v":"Sep"},2033,null,null,null,null,null,null,null,null,null,null,null,null,null,null,null,null,null,null,null,null,null,null,null,null,{"$f":"IF(OR(AND(E650=\"Feb\",OR(F650=2020,OR(F650=2024,OR(F650=2028,OR(F650=2032,OR(F650=2036,F650=2040)))))),AND(E650=\"Feb\",OR(F650=2044,OR(F650=2048,F650=2052)))),29,VLOOKUP(E650,Lookup!$B$2:$C$13,2,FALSE))","v":30},0,null,null,12]
[null,null,null,{"$f":"+D639+1","v":12},{"$f":"IF(E650=\"\",\"\",VLOOKUP(E650,Lookup!$A$2:$B$13,2,FALSE))","v":"Oct"},2033,null,null,null,null,null,null,null,null,null,null,null,null,null,null,null,null,null,null,null,null,null,null,null,null,{"$f":"IF(OR(AND(E651=\"Feb\",OR(F651=2020,OR(F651=2024,OR(F651=2028,OR(F651=2032,OR(F651=2036,F651=2040)))))),AND(E651=\"Feb\",OR(F651=2044,OR(F651=2048,F651=2052)))),29,VLOOKUP(E651,Lookup!$B$2:$C$13,2,FALSE))","v":31},0,null,null,12]
[null,null,null,12,{"$f":"IF(E651=\"\",\"\",VLOOKUP(E651,Lookup!$A$2:$B$13,2,FALSE))","v":"Nov"},2033,null,null,null,null,null,null,null,null,null,null,null,null,null,null,null,null,null,null,null,null,null,null,null,null,{"$f":"IF(OR(AND(E652=\"Feb\",OR(F652=2020,OR(F652=2024,OR(F652=2028,OR(F652=2032,OR(F652=2036,F652=2040)))))),AND(E652=\"Feb\",OR(F652=2044,OR(F652=2048,F652=2052)))),29,VLOOKUP(E652,Lookup!$B$2:$C$13,2,FALSE))","v":30},0,null,null,12]
[null,null,null,12,{"$f":"IF(E652=\"\",\"\",VLOOKUP(E652,Lookup!$A$2:$B$13,2,FALSE))","v":"Dec"},2033,null,null,null,null,null,null,null,null,null,null,null,null,null,null,null,null,null,null,null,null,null,null,null,null,{"$f":"IF(OR(AND(E653=\"Feb\",OR(F653=2020,OR(F653=2024,OR(F653=2028,OR(F653=2032,OR(F653=2036,F653=2040)))))),AND(E653=\"Feb\",OR(F653=2044,OR(F653=2048,F653=2052)))),29,VLOOKUP(E653,Lookup!$B$2:$C$13,2,FALSE))","v":31},0,null,null,12]
[null,null,null,13,{"$f":"IF(E653=\"\",\"\",VLOOKUP(E653,Lookup!$A$2:$B$13,2,FALSE))","v":"Jan"},2034,null,null,null,null,null,null,null,null,null,null,null,null,null,null,null,null,null,null,null,null,null,null,null,null,{"$f":"IF(OR(AND(E654=\"Feb\",OR(F654=2020,OR(F654=2024,OR(F654=2028,OR(F654=2032,OR(F654=2036,F654=2040)))))),AND(E654=\"Feb\",OR(F654=2044,OR(F654=2048,F654=2052)))),29,VLOOKUP(E654,Lookup!$B$2:$C$13,2,FALSE))","v":31},0,null,null,{"$f":"+D654","v":13}]
[null,null,null,13,{"$f":"IF(E654=\"\",\"\",VLOOKUP(E654,Lookup!$A$2:$B$13,2,FALSE))","v":"Feb"},2034,null,null,null,null,null,null,null,null,null,null,null,null,null,null,null,null,null,null,null,null,null,null,null,null,{"$f":"IF(OR(AND(E655=\"Feb\",OR(F655=2020,OR(F655=2024,OR(F655=2028,OR(F655=2032,OR(F655=2036,F655=2040)))))),AND(E655=\"Feb\",OR(F655=2044,OR(F655=2048,F655=2052)))),29,VLOOKUP(E655,Lookup!$B$2:$C$13,2,FALSE))","v":28},0,null,null,13]
[null,null,null,13,{"$f":"IF(E655=\"\",\"\",VLOOKUP(E655,Lookup!$A$2:$B$13,2,FALSE))","v":"Mar"},2034,null,null,null,null,null,null,null,null,null,null,null,null,null,null,null,null,null,null,null,null,null,null,null,null,{"$f":"IF(OR(AND(E656=\"Feb\",OR(F656=2020,OR(F656=2024,OR(F656=2028,OR(F656=2032,OR(F656=2036,F656=2040)))))),AND(E656=\"Feb\",OR(F656=2044,OR(F656=2048,F656=2052)))),29,VLOOKUP(E656,Lookup!$B$2:$C$13,2,FALSE))","v":31},0,null,null,13]
[null,null,null,13,{"$f":"IF(E656=\"\",\"\",VLOOKUP(E656,Lookup!$A$2:$B$13,2,FALSE))","v":"Apr"},2034,null,null,null,null,null,null,null,null,null,null,null,null,null,null,null,null,null,null,null,null,null,null,null,null,{"$f":"IF(OR(AND(E657=\"Feb\",OR(F657=2020,OR(F657=2024,OR(F657=2028,OR(F657=2032,OR(F657=2036,F657=2040)))))),AND(E657=\"Feb\",OR(F657=2044,OR(F657=2048,F657=2052)))),29,VLOOKUP(E657,Lookup!$B$2:$C$13,2,FALSE))","v":30},0,null,null,13]
[null,null,null,13,{"$f":"IF(E657=\"\",\"\",VLOOKUP(E657,Lookup!$A$2:$B$13,2,FALSE))","v":"May"},2034,null,null,null,null,null,null,null,null,null,null,null,null,null,null,null,null,null,null,null,null,null,null,null,null,{"$f":"IF(OR(AND(E658=\"Feb\",OR(F658=2020,OR(F658=2024,OR(F658=2028,OR(F658=2032,OR(F658=2036,F658=2040)))))),AND(E658=\"Feb\",OR(F658=2044,OR(F658=2048,F658=2052)))),29,VLOOKUP(E658,Lookup!$B$2:$C$13,2,FALSE))","v":31},0,null,null,13]
[null,null,null,13,{"$f":"IF(E658=\"\",\"\",VLOOKUP(E658,Lookup!$A$2:$B$13,2,FALSE))","v":"Jun"},2034,null,null,null,null,null,null,null,null,null,null,null,null,null,null,null,null,null,null,null,null,null,null,null,null,{"$f":"IF(OR(AND(E659=\"Feb\",OR(F659=2020,OR(F659=2024,OR(F659=2028,OR(F659=2032,OR(F659=2036,F659=2040)))))),AND(E659=\"Feb\",OR(F659=2044,OR(F659=2048,F659=2052)))),29,VLOOKUP(E659,Lookup!$B$2:$C$13,2,FALSE))","v":30},0,null,null,13]
[null,null,null,13,{"$f":"IF(E659=\"\",\"\",VLOOKUP(E659,Lookup!$A$2:$B$13,2,FALSE))","v":"Jul"},2034,null,null,null,null,null,null,null,null,null,null,null,null,null,null,null,null,null,null,null,null,null,null,null,null,{"$f":"IF(OR(AND(E660=\"Feb\",OR(F660=2020,OR(F660=2024,OR(F660=2028,OR(F660=2032,OR(F660=2036,F660=2040)))))),AND(E660=\"Feb\",OR(F660=2044,OR(F660=2048,F660=2052)))),29,VLOOKUP(E660,Lookup!$B$2:$C$13,2,FALSE))","v":31},0,null,null,13]
[null,null,null,13,{"$f":"IF(E660=\"\",\"\",VLOOKUP(E660,Lookup!$A$2:$B$13,2,FALSE))","v":"Aug"},2034,null,null,null,null,null,null,null,null,null,null,null,null,null,null,null,null,null,null,null,null,null,null,null,null,{"$f":"IF(OR(AND(E661=\"Feb\",OR(F661=2020,OR(F661=2024,OR(F661=2028,OR(F661=2032,OR(F661=2036,F661=2040)))))),AND(E661=\"Feb\",OR(F661=2044,OR(F661=2048,F661=2052)))),29,VLOOKUP(E661,Lookup!$B$2:$C$13,2,FALSE))","v":31},0,null,null,13]
[null,null,null,13,{"$f":"IF(E661=\"\",\"\",VLOOKUP(E661,Lookup!$A$2:$B$13,2,FALSE))","v":"Sep"},2034,null,null,null,null,null,null,null,null,null,null,null,null,null,null,null,null,null,null,null,null,null,null,null,null,{"$f":"IF(OR(AND(E662=\"Feb\",OR(F662=2020,OR(F662=2024,OR(F662=2028,OR(F662=2032,OR(F662=2036,F662=2040)))))),AND(E662=\"Feb\",OR(F662=2044,OR(F662=2048,F662=2052)))),29,VLOOKUP(E662,Lookup!$B$2:$C$13,2,FALSE))","v":30},0,null,null,13]
[null,null,null,13,{"$f":"IF(E662=\"\",\"\",VLOOKUP(E662,Lookup!$A$2:$B$13,2,FALSE))","v":"Oct"},2034,null,null,null,null,null,null,null,null,null,null,null,null,null,null,null,null,null,null,null,null,null,null,null,null,{"$f":"IF(OR(AND(E663=\"Feb\",OR(F663=2020,OR(F663=2024,OR(F663=2028,OR(F663=2032,OR(F663=2036,F663=2040)))))),AND(E663=\"Feb\",OR(F663=2044,OR(F663=2048,F663=2052)))),29,VLOOKUP(E663,Lookup!$B$2:$C$13,2,FALSE))","v":31},0,null,null,13]
[null,null,null,13,{"$f":"IF(E663=\"\",\"\",VLOOKUP(E663,Lookup!$A$2:$B$13,2,FALSE))","v":"Nov"},2034,null,null,null,null,null,null,null,null,null,null,null,null,null,null,null,null,null,null,null,null,null,null,null,null,{"$f":"IF(OR(AND(E664=\"Feb\",OR(F664=2020,OR(F664=2024,OR(F664=2028,OR(F664=2032,OR(F664=2036,F664=2040)))))),AND(E664=\"Feb\",OR(F664=2044,OR(F664=2048,F664=2052)))),29,VLOOKUP(E664,Lookup!$B$2:$C$13,2,FALSE))","v":30},0,null,null,13]
[null,null,null,13,{"$f":"IF(E664=\"\",\"\",VLOOKUP(E664,Lookup!$A$2:$B$13,2,FALSE))","v":"Dec"},2034,null,null,null,null,null,null,null,null,null,null,null,null,null,null,null,null,null,null,null,null,null,null,null,null,{"$f":"IF(OR(AND(E665=\"Feb\",OR(F665=2020,OR(F665=2024,OR(F665=2028,OR(F665=2032,OR(F665=2036,F665=2040)))))),AND(E665=\"Feb\",OR(F665=2044,OR(F665=2048,F665=2052)))),29,VLOOKUP(E665,Lookup!$B$2:$C$13,2,FALSE))","v":31},0,null,null,13]
[null,null,null,14,{"$f":"IF(E665=\"\",\"\",VLOOKUP(E665,Lookup!$A$2:$B$13,2,FALSE))","v":"Jan"},2035,null,null,null,null,null,null,null,null,null,null,null,null,null,null,null,null,null,null,null,null,null,null,null,null,{"$f":"IF(OR(AND(E666=\"Feb\",OR(F666=2020,OR(F666=2024,OR(F666=2028,OR(F666=2032,OR(F666=2036,F666=2040)))))),AND(E666=\"Feb\",OR(F666=2044,OR(F666=2048,F666=2052)))),29,VLOOKUP(E666,Lookup!$B$2:$C$13,2,FALSE))","v":31},0,null,null,14]
[null,null,null,14,{"$f":"IF(E666=\"\",\"\",VLOOKUP(E666,Lookup!$A$2:$B$13,2,FALSE))","v":"Feb"},2035,null,null,null,null,null,null,null,null,null,null,null,null,null,null,null,null,null,null,null,null,null,null,null,null,{"$f":"IF(OR(AND(E667=\"Feb\",OR(F667=2020,OR(F667=2024,OR(F667=2028,OR(F667=2032,OR(F667=2036,F667=2040)))))),AND(E667=\"Feb\",OR(F667=2044,OR(F667=2048,F667=2052)))),29,VLOOKUP(E667,Lookup!$B$2:$C$13,2,FALSE))","v":28},0,null,null,14]
[null,null,null,14,{"$f":"IF(E667=\"\",\"\",VLOOKUP(E667,Lookup!$A$2:$B$13,2,FALSE))","v":"Mar"},2035,null,null,null,null,null,null,null,null,null,null,null,null,null,null,null,null,null,null,null,null,null,null,null,null,{"$f":"IF(OR(AND(E668=\"Feb\",OR(F668=2020,OR(F668=2024,OR(F668=2028,OR(F668=2032,OR(F668=2036,F668=2040)))))),AND(E668=\"Feb\",OR(F668=2044,OR(F668=2048,F668=2052)))),29,VLOOKUP(E668,Lookup!$B$2:$C$13,2,FALSE))","v":31},0,null,null,14]
[null,null,null,14,{"$f":"IF(E668=\"\",\"\",VLOOKUP(E668,Lookup!$A$2:$B$13,2,FALSE))","v":"Apr"},2035,null,null,null,null,null,null,null,null,null,null,null,null,null,null,null,null,null,null,null,null,null,null,null,null,{"$f":"IF(OR(AND(E669=\"Feb\",OR(F669=2020,OR(F669=2024,OR(F669=2028,OR(F669=2032,OR(F669=2036,F669=2040)))))),AND(E669=\"Feb\",OR(F669=2044,OR(F669=2048,F669=2052)))),29,VLOOKUP(E669,Lookup!$B$2:$C$13,2,FALSE))","v":30},0,null,null,14]
[null,null,null,14,{"$f":"IF(E669=\"\",\"\",VLOOKUP(E669,Lookup!$A$2:$B$13,2,FALSE))","v":"May"},2035,null,null,null,null,null,null,null,null,null,null,null,null,null,null,null,null,null,null,null,null,null,null,null,null,{"$f":"IF(OR(AND(E670=\"Feb\",OR(F670=2020,OR(F670=2024,OR(F670=2028,OR(F670=2032,OR(F670=2036,F670=2040)))))),AND(E670=\"Feb\",OR(F670=2044,OR(F670=2048,F670=2052)))),29,VLOOKUP(E670,Lookup!$B$2:$C$13,2,FALSE))","v":31},0,null,null,14]
[null,null,null,14,{"$f":"IF(E670=\"\",\"\",VLOOKUP(E670,Lookup!$A$2:$B$13,2,FALSE))","v":"Jun"},2035,null,null,null,null,null,null,null,null,null,null,null,null,null,null,null,null,null,null,null,null,null,null,null,null,{"$f":"IF(OR(AND(E671=\"Feb\",OR(F671=2020,OR(F671=2024,OR(F671=2028,OR(F671=2032,OR(F671=2036,F671=2040)))))),AND(E671=\"Feb\",OR(F671=2044,OR(F671=2048,F671=2052)))),29,VLOOKUP(E671,Lookup!$B$2:$C$13,2,FALSE))","v":30},0,null,null,14]
[null,null,null,14,{"$f":"IF(E671=\"\",\"\",VLOOKUP(E671,Lookup!$A$2:$B$13,2,FALSE))","v":"Jul"},2035,null,null,null,null,null,null,null,null,null,null,null,null,null,null,null,null,null,null,null,null,null,null,null,null,{"$f":"IF(OR(AND(E672=\"Feb\",OR(F672=2020,OR(F672=2024,OR(F672=2028,OR(F672=2032,OR(F672=2036,F672=2040)))))),AND(E672=\"Feb\",OR(F672=2044,OR(F672=2048,F672=2052)))),29,VLOOKUP(E672,Lookup!$B$2:$C$13,2,FALSE))","v":31},0,null,null,14]
[null,null,null,14,{"$f":"IF(E672=\"\",\"\",VLOOKUP(E672,Lookup!$A$2:$B$13,2,FALSE))","v":"Aug"},2035,null,null,null,null,null,null,null,null,null,null,null,null,null,null,null,null,null,null,null,null,null,null,null,null,{"$f":"IF(OR(AND(E673=\"Feb\",OR(F673=2020,OR(F673=2024,OR(F673=2028,OR(F673=2032,OR(F673=2036,F673=2040)))))),AND(E673=\"Feb\",OR(F673=2044,OR(F673=2048,F673=2052)))),29,VLOOKUP(E673,Lookup!$B$2:$C$13,2,FALSE))","v":31},0,null,null,14]
[null,null,null,14,{"$f":"IF(E673=\"\",\"\",VLOOKUP(E673,Lookup!$A$2:$B$13,2,FALSE))","v":"Sep"},2035,null,null,null,null,null,null,null,null,null,null,null,null,null,null,null,null,null,null,null,null,null,null,null,null,{"$f":"IF(OR(AND(E674=\"Feb\",OR(F674=2020,OR(F674=2024,OR(F674=2028,OR(F674=2032,OR(F674=2036,F674=2040)))))),AND(E674=\"Feb\",OR(F674=2044,OR(F674=2048,F674=2052)))),29,VLOOKUP(E674,Lookup!$B$2:$C$13,2,FALSE))","v":30},0,null,null,14]
[null,null,null,14,{"$f":"IF(E674=\"\",\"\",VLOOKUP(E674,Lookup!$A$2:$B$13,2,FALSE))","v":"Oct"},2035,null,null,null,null,null,null,null,null,null,null,null,null,null,null,null,null,null,null,null,null,null,null,null,null,{"$f":"IF(OR(AND(E675=\"Feb\",OR(F675=2020,OR(F675=2024,OR(F675=2028,OR(F675=2032,OR(F675=2036,F675=2040)))))),AND(E675=\"Feb\",OR(F675=2044,OR(F675=2048,F675=2052)))),29,VLOOKUP(E675,Lookup!$B$2:$C$13,2,FALSE))","v":31},0,null,null,14]
[null,null,null,14,{"$f":"IF(E675=\"\",\"\",VLOOKUP(E675,Lookup!$A$2:$B$13,2,FALSE))","v":"Nov"},2035,null,null,null,null,null,null,null,null,null,null,null,null,null,null,null,null,null,null,null,null,null,null,null,null,{"$f":"IF(OR(AND(E676=\"Feb\",OR(F676=2020,OR(F676=2024,OR(F676=2028,OR(F676=2032,OR(F676=2036,F676=2040)))))),AND(E676=\"Feb\",OR(F676=2044,OR(F676=2048,F676=2052)))),29,VLOOKUP(E676,Lookup!$B$2:$C$13,2,FALSE))","v":30},0,null,null,14]
[null,null,null,14,{"$f":"IF(E676=\"\",\"\",VLOOKUP(E676,Lookup!$A$2:$B$13,2,FALSE))","v":"Dec"},2035,null,null,null,null,null,null,null,null,null,null,null,null,null,null,null,null,null,null,null,null,null,null,null,null,{"$f":"IF(OR(AND(E677=\"Feb\",OR(F677=2020,OR(F677=2024,OR(F677=2028,OR(F677=2032,OR(F677=2036,F677=2040)))))),AND(E677=\"Feb\",OR(F677=2044,OR(F677=2048,F677=2052)))),29,VLOOKUP(E677,Lookup!$B$2:$C$13,2,FALSE))","v":31},0,null,null,14]
[null,null,null,15,{"$f":"IF(E677=\"\",\"\",VLOOKUP(E677,Lookup!$A$2:$B$13,2,FALSE))","v":"Jan"},2036,null,null,null,null,null,null,null,null,null,null,null,null,null,null,null,null,null,null,null,null,null,null,null,null,{"$f":"IF(OR(AND(E678=\"Feb\",OR(F678=2020,OR(F678=2024,OR(F678=2028,OR(F678=2032,OR(F678=2036,F678=2040)))))),AND(E678=\"Feb\",OR(F678=2044,OR(F678=2048,F678=2052)))),29,VLOOKUP(E678,Lookup!$B$2:$C$13,2,FALSE))","v":31},0,null,null,15]
[null,null,null,15,{"$f":"IF(E678=\"\",\"\",VLOOKUP(E678,Lookup!$A$2:$B$13,2,FALSE))","v":"Feb"},2036,null,null,null,null,null,null,null,null,null,null,null,null,null,null,null,null,null,null,null,null,null,null,null,null,{"$f":"IF(OR(AND(E679=\"Feb\",OR(F679=2020,OR(F679=2024,OR(F679=2028,OR(F679=2032,OR(F679=2036,F679=2040)))))),AND(E679=\"Feb\",OR(F679=2044,OR(F679=2048,F679=2052)))),29,VLOOKUP(E679,Lookup!$B$2:$C$13,2,FALSE))","v":29},0,null,null,15]
[null,null,null,15,{"$f":"IF(E679=\"\",\"\",VLOOKUP(E679,Lookup!$A$2:$B$13,2,FALSE))","v":"Mar"},2036,null,null,null,null,null,null,null,null,null,null,null,null,null,null,null,null,null,null,null,null,null,null,null,null,{"$f":"IF(OR(AND(E680=\"Feb\",OR(F680=2020,OR(F680=2024,OR(F680=2028,OR(F680=2032,OR(F680=2036,F680=2040)))))),AND(E680=\"Feb\",OR(F680=2044,OR(F680=2048,F680=2052)))),29,VLOOKUP(E680,Lookup!$B$2:$C$13,2,FALSE))","v":31},0,null,null,15]
[null,null,null,15,{"$f":"IF(E680=\"\",\"\",VLOOKUP(E680,Lookup!$A$2:$B$13,2,FALSE))","v":"Apr"},2036,null,null,null,null,null,null,null,null,null,null,null,null,null,null,null,null,null,null,null,null,null,null,null,null,{"$f":"IF(OR(AND(E681=\"Feb\",OR(F681=2020,OR(F681=2024,OR(F681=2028,OR(F681=2032,OR(F681=2036,F681=2040)))))),AND(E681=\"Feb\",OR(F681=2044,OR(F681=2048,F681=2052)))),29,VLOOKUP(E681,Lookup!$B$2:$C$13,2,FALSE))","v":30},0,null,null,15]
[null,null,null,15,{"$f":"IF(E681=\"\",\"\",VLOOKUP(E681,Lookup!$A$2:$B$13,2,FALSE))","v":"May"},2036,null,null,null,null,null,null,null,null,null,null,null,null,null,null,null,null,null,null,null,null,null,null,null,null,{"$f":"IF(OR(AND(E682=\"Feb\",OR(F682=2020,OR(F682=2024,OR(F682=2028,OR(F682=2032,OR(F682=2036,F682=2040)))))),AND(E682=\"Feb\",OR(F682=2044,OR(F682=2048,F682=2052)))),29,VLOOKUP(E682,Lookup!$B$2:$C$13,2,FALSE))","v":31},0,null,null,15]
[null,null,null,15,{"$f":"IF(E682=\"\",\"\",VLOOKUP(E682,Lookup!$A$2:$B$13,2,FALSE))","v":"Jun"},2036,null,null,null,null,null,null,null,null,null,null,null,null,null,null,null,null,null,null,null,null,null,null,null,null,{"$f":"IF(OR(AND(E683=\"Feb\",OR(F683=2020,OR(F683=2024,OR(F683=2028,OR(F683=2032,OR(F683=2036,F683=2040)))))),AND(E683=\"Feb\",OR(F683=2044,OR(F683=2048,F683=2052)))),29,VLOOKUP(E683,Lookup!$B$2:$C$13,2,FALSE))","v":30},0,null,null,15]
[null,null,null,15,{"$f":"IF(E683=\"\",\"\",VLOOKUP(E683,Lookup!$A$2:$B$13,2,FALSE))","v":"Jul"},2036,null,null,null,null,null,null,null,null,null,null,null,null,null,null,null,null,null,null,null,null,null,null,null,null,{"$f":"IF(OR(AND(E684=\"Feb\",OR(F684=2020,OR(F684=2024,OR(F684=2028,OR(F684=2032,OR(F684=2036,F684=2040)))))),AND(E684=\"Feb\",OR(F684=2044,OR(F684=2048,F684=2052)))),29,VLOOKUP(E684,Lookup!$B$2:$C$13,2,FALSE))","v":31},0,null,null,15]
[null,null,null,15,{"$f":"IF(E684=\"\",\"\",VLOOKUP(E684,Lookup!$A$2:$B$13,2,FALSE))","v":"Aug"},2036,null,null,null,null,null,null,null,null,null,null,null,null,null,null,null,null,null,null,null,null,null,null,null,null,{"$f":"IF(OR(AND(E685=\"Feb\",OR(F685=2020,OR(F685=2024,OR(F685=2028,OR(F685=2032,OR(F685=2036,F685=2040)))))),AND(E685=\"Feb\",OR(F685=2044,OR(F685=2048,F685=2052)))),29,VLOOKUP(E685,Lookup!$B$2:$C$13,2,FALSE))","v":31},0,null,null,15]
[null,null,null,15,{"$f":"IF(E685=\"\",\"\",VLOOKUP(E685,Lookup!$A$2:$B$13,2,FALSE))","v":"Sep"},2036,null,null,null,null,null,null,null,null,null,null,null,null,null,null,null,null,null,null,null,null,null,null,null,null,{"$f":"IF(OR(AND(E686=\"Feb\",OR(F686=2020,OR(F686=2024,OR(F686=2028,OR(F686=2032,OR(F686=2036,F686=2040)))))),AND(E686=\"Feb\",OR(F686=2044,OR(F686=2048,F686=2052)))),29,VLOOKUP(E686,Lookup!$B$2:$C$13,2,FALSE))","v":30},0,null,null,{"$f":"+D686","v":15}]
[null,null,null,15,{"$f":"IF(E686=\"\",\"\",VLOOKUP(E686,Lookup!$A$2:$B$13,2,FALSE))","v":"Oct"},2036,null,null,null,null,null,null,null,null,null,null,null,null,null,null,null,null,null,null,null,null,null,null,null,null,{"$f":"IF(OR(AND(E687=\"Feb\",OR(F687=2020,OR(F687=2024,OR(F687=2028,OR(F687=2032,OR(F687=2036,F687=2040)))))),AND(E687=\"Feb\",OR(F687=2044,OR(F687=2048,F687=2052)))),29,VLOOKUP(E687,Lookup!$B$2:$C$13,2,FALSE))","v":31},0,null,null,15]
[null,null,null,15,{"$f":"IF(E687=\"\",\"\",VLOOKUP(E687,Lookup!$A$2:$B$13,2,FALSE))","v":"Nov"},2036,null,null,null,null,null,null,null,null,null,null,null,null,null,null,null,null,null,null,null,null,null,null,null,null,{"$f":"IF(OR(AND(E688=\"Feb\",OR(F688=2020,OR(F688=2024,OR(F688=2028,OR(F688=2032,OR(F688=2036,F688=2040)))))),AND(E688=\"Feb\",OR(F688=2044,OR(F688=2048,F688=2052)))),29,VLOOKUP(E688,Lookup!$B$2:$C$13,2,FALSE))","v":30},0,null,null,15]
[null,null,null,15,{"$f":"IF(E688=\"\",\"\",VLOOKUP(E688,Lookup!$A$2:$B$13,2,FALSE))","v":"Dec"},2036,null,null,null,null,null,null,null,null,null,null,null,null,null,null,null,null,null,null,null,null,null,null,null,null,{"$f":"IF(OR(AND(E689=\"Feb\",OR(F689=2020,OR(F689=2024,OR(F689=2028,OR(F689=2032,OR(F689=2036,F689=2040)))))),AND(E689=\"Feb\",OR(F689=2044,OR(F689=2048,F689=2052)))),29,VLOOKUP(E689,Lookup!$B$2:$C$13,2,FALSE))","v":31},0,null,null,15]
[null,null,null,16,{"$f":"IF(E689=\"\",\"\",VLOOKUP(E689,Lookup!$A$2:$B$13,2,FALSE))","v":"Jan"},2037,null,null,null,null,null,null,null,null,null,null,null,null,null,null,null,null,null,null,null,null,null,null,null,null,{"$f":"IF(OR(AND(E690=\"Feb\",OR(F690=2020,OR(F690=2024,OR(F690=2028,OR(F690=2032,OR(F690=2036,F690=2040)))))),AND(E690=\"Feb\",OR(F690=2044,OR(F690=2048,F690=2052)))),29,VLOOKUP(E690,Lookup!$B$2:$C$13,2,FALSE))","v":31},0,null,null,16]
[null,null,null,16,{"$f":"IF(E690=\"\",\"\",VLOOKUP(E690,Lookup!$A$2:$B$13,2,FALSE))","v":"Feb"},2037,null,null,null,null,null,null,null,null,null,null,null,null,null,null,null,null,null,null,null,null,null,null,null,null,{"$f":"IF(OR(AND(E691=\"Feb\",OR(F691=2020,OR(F691=2024,OR(F691=2028,OR(F691=2032,OR(F691=2036,F691=2040)))))),AND(E691=\"Feb\",OR(F691=2044,OR(F691=2048,F691=2052)))),29,VLOOKUP(E691,Lookup!$B$2:$C$13,2,FALSE))","v":28},0,null,null,16]
[null,null,null,16,{"$f":"IF(E691=\"\",\"\",VLOOKUP(E691,Lookup!$A$2:$B$13,2,FALSE))","v":"Mar"},2037,null,null,null,null,null,null,null,null,null,null,null,null,null,null,null,null,null,null,null,null,null,null,null,null,{"$f":"IF(OR(AND(E692=\"Feb\",OR(F692=2020,OR(F692=2024,OR(F692=2028,OR(F692=2032,OR(F692=2036,F692=2040)))))),AND(E692=\"Feb\",OR(F692=2044,OR(F692=2048,F692=2052)))),29,VLOOKUP(E692,Lookup!$B$2:$C$13,2,FALSE))","v":31},0,null,null,16]
[null,null,null,16,{"$f":"IF(E692=\"\",\"\",VLOOKUP(E692,Lookup!$A$2:$B$13,2,FALSE))","v":"Apr"},2037,null,null,null,null,null,null,null,null,null,null,null,null,null,null,null,null,null,null,null,null,null,null,null,null,{"$f":"IF(OR(AND(E693=\"Feb\",OR(F693=2020,OR(F693=2024,OR(F693=2028,OR(F693=2032,OR(F693=2036,F693=2040)))))),AND(E693=\"Feb\",OR(F693=2044,OR(F693=2048,F693=2052)))),29,VLOOKUP(E693,Lookup!$B$2:$C$13,2,FALSE))","v":30},0,null,null,16]
[null,null,null,16,{"$f":"IF(E693=\"\",\"\",VLOOKUP(E693,Lookup!$A$2:$B$13,2,FALSE))","v":"May"},2037,null,null,null,null,null,null,null,null,null,null,null,null,null,null,null,null,null,null,null,null,null,null,null,null,{"$f":"IF(OR(AND(E694=\"Feb\",OR(F694=2020,OR(F694=2024,OR(F694=2028,OR(F694=2032,OR(F694=2036,F694=2040)))))),AND(E694=\"Feb\",OR(F694=2044,OR(F694=2048,F694=2052)))),29,VLOOKUP(E694,Lookup!$B$2:$C$13,2,FALSE))","v":31},0,null,null,16]
[null,null,null,16,{"$f":"IF(E694=\"\",\"\",VLOOKUP(E694,Lookup!$A$2:$B$13,2,FALSE))","v":"Jun"},2037,null,null,null,null,null,null,null,null,null,null,null,null,null,null,null,null,null,null,null,null,null,null,null,null,{"$f":"IF(OR(AND(E695=\"Feb\",OR(F695=2020,OR(F695=2024,OR(F695=2028,OR(F695=2032,OR(F695=2036,F695=2040)))))),AND(E695=\"Feb\",OR(F695=2044,OR(F695=2048,F695=2052)))),29,VLOOKUP(E695,Lookup!$B$2:$C$13,2,FALSE))","v":30},0,null,null,16]
[null,null,null,16,{"$f":"IF(E695=\"\",\"\",VLOOKUP(E695,Lookup!$A$2:$B$13,2,FALSE))","v":"Jul"},2037,null,null,null,null,null,null,null,null,null,null,null,null,null,null,null,null,null,null,null,null,null,null,null,null,{"$f":"IF(OR(AND(E696=\"Feb\",OR(F696=2020,OR(F696=2024,OR(F696=2028,OR(F696=2032,OR(F696=2036,F696=2040)))))),AND(E696=\"Feb\",OR(F696=2044,OR(F696=2048,F696=2052)))),29,VLOOKUP(E696,Lookup!$B$2:$C$13,2,FALSE))","v":31},0,null,null,16]
[null,null,null,16,{"$f":"IF(E696=\"\",\"\",VLOOKUP(E696,Lookup!$A$2:$B$13,2,FALSE))","v":"Aug"},2037,null,null,null,null,null,null,null,null,null,null,null,null,null,null,null,null,null,null,null,null,null,null,null,null,{"$f":"IF(OR(AND(E697=\"Feb\",OR(F697=2020,OR(F697=2024,OR(F697=2028,OR(F697=2032,OR(F697=2036,F697=2040)))))),AND(E697=\"Feb\",OR(F697=2044,OR(F697=2048,F697=2052)))),29,VLOOKUP(E697,Lookup!$B$2:$C$13,2,FALSE))","v":31},0,null,null,16]
[null,null,null,16,{"$f":"IF(E697=\"\",\"\",VLOOKUP(E697,Lookup!$A$2:$B$13,2,FALSE))","v":"Sep"},2037,null,null,null,null,null,null,null,null,null,null,null,null,null,null,null,null,null,null,null,null,null,null,null,null,{"$f":"IF(OR(AND(E698=\"Feb\",OR(F698=2020,OR(F698=2024,OR(F698=2028,OR(F698=2032,OR(F698=2036,F698=2040)))))),AND(E698=\"Feb\",OR(F698=2044,OR(F698=2048,F698=2052)))),29,VLOOKUP(E698,Lookup!$B$2:$C$13,2,FALSE))","v":30},0,null,null,16]
[null,null,null,16,{"$f":"IF(E698=\"\",\"\",VLOOKUP(E698,Lookup!$A$2:$B$13,2,FALSE))","v":"Oct"},2037,null,null,null,null,null,null,null,null,null,null,null,null,null,null,null,null,null,null,null,null,null,null,null,null,{"$f":"IF(OR(AND(E699=\"Feb\",OR(F699=2020,OR(F699=2024,OR(F699=2028,OR(F699=2032,OR(F699=2036,F699=2040)))))),AND(E699=\"Feb\",OR(F699=2044,OR(F699=2048,F699=2052)))),29,VLOOKUP(E699,Lookup!$B$2:$C$13,2,FALSE))","v":31},0,null,null,16]
[null,null,null,16,{"$f":"IF(E699=\"\",\"\",VLOOKUP(E699,Lookup!$A$2:$B$13,2,FALSE))","v":"Nov"},2037,null,null,null,null,null,null,null,null,null,null,null,null,null,null,null,null,null,null,null,null,null,null,null,null,{"$f":"IF(OR(AND(E700=\"Feb\",OR(F700=2020,OR(F700=2024,OR(F700=2028,OR(F700=2032,OR(F700=2036,F700=2040)))))),AND(E700=\"Feb\",OR(F700=2044,OR(F700=2048,F700=2052)))),29,VLOOKUP(E700,Lookup!$B$2:$C$13,2,FALSE))","v":30},0,null,null,16]
[null,null,null,16,{"$f":"IF(E700=\"\",\"\",VLOOKUP(E700,Lookup!$A$2:$B$13,2,FALSE))","v":"Dec"},2037,null,null,null,null,null,null,null,null,null,null,null,null,null,null,null,null,null,null,null,null,null,null,null,null,{"$f":"IF(OR(AND(E701=\"Feb\",OR(F701=2020,OR(F701=2024,OR(F701=2028,OR(F701=2032,OR(F701=2036,F701=2040)))))),AND(E701=\"Feb\",OR(F701=2044,OR(F701=2048,F701=2052)))),29,VLOOKUP(E701,Lookup!$B$2:$C$13,2,FALSE))","v":31},0,null,null,16]
[null,null,null,17,{"$f":"IF(E701=\"\",\"\",VLOOKUP(E701,Lookup!$A$2:$B$13,2,FALSE))","v":"Jan"},2038,null,null,null,null,null,null,null,null,null,null,null,null,null,null,null,null,null,null,null,null,null,null,null,null,{"$f":"IF(OR(AND(E702=\"Feb\",OR(F702=2020,OR(F702=2024,OR(F702=2028,OR(F702=2032,OR(F702=2036,F702=2040)))))),AND(E702=\"Feb\",OR(F702=2044,OR(F702=2048,F702=2052)))),29,VLOOKUP(E702,Lookup!$B$2:$C$13,2,FALSE))","v":31},{"$f":"SUM(G702:AD702)*AE702","v":0},null,null,17]
[null,null,null,17,{"$f":"IF(E702=\"\",\"\",VLOOKUP(E702,Lookup!$A$2:$B$13,2,FALSE))","v":"Feb"},{"$f":"IF(E702=0,\"\",IF(E702=\"Dec\",F702+1,F702))","v":2038},null,null,null,null,null,null,null,null,null,null,null,null,null,null,null,null,null,null,null,null,null,null,null,null,{"$f":"IF(OR(AND(E703=\"Feb\",OR(F703=2020,OR(F703=2024,OR(F703=2028,OR(F703=2032,OR(F703=2036,F703=2040)))))),AND(E703=\"Feb\",OR(F703=2044,OR(F703=2048,F703=2052)))),29,VLOOKUP(E703,Lookup!$B$2:$C$13,2,FALSE))","v":28},0,null,null,17]
[null,null,null,17,{"$f":"IF(E703=\"\",\"\",VLOOKUP(E703,Lookup!$A$2:$B$13,2,FALSE))","v":"Mar"},2038,null,null,null,null,null,null,null,null,null,null,null,null,null,null,null,null,null,null,null,null,null,null,null,null,{"$f":"IF(OR(AND(E704=\"Feb\",OR(F704=2020,OR(F704=2024,OR(F704=2028,OR(F704=2032,OR(F704=2036,F704=2040)))))),AND(E704=\"Feb\",OR(F704=2044,OR(F704=2048,F704=2052)))),29,VLOOKUP(E704,Lookup!$B$2:$C$13,2,FALSE))","v":31},0,null,null,17]
[null,null,null,17,{"$f":"IF(E704=\"\",\"\",VLOOKUP(E704,Lookup!$A$2:$B$13,2,FALSE))","v":"Apr"},2038,null,null,null,null,null,null,null,null,null,null,null,null,null,null,null,null,null,null,null,null,null,null,null,null,{"$f":"IF(OR(AND(E705=\"Feb\",OR(F705=2020,OR(F705=2024,OR(F705=2028,OR(F705=2032,OR(F705=2036,F705=2040)))))),AND(E705=\"Feb\",OR(F705=2044,OR(F705=2048,F705=2052)))),29,VLOOKUP(E705,Lookup!$B$2:$C$13,2,FALSE))","v":30},0,null,null,17]
[null,null,null,17,{"$f":"IF(E705=\"\",\"\",VLOOKUP(E705,Lookup!$A$2:$B$13,2,FALSE))","v":"May"},2038,null,null,null,null,null,null,null,null,null,null,null,null,null,null,null,null,null,null,null,null,null,null,null,null,{"$f":"IF(OR(AND(E706=\"Feb\",OR(F706=2020,OR(F706=2024,OR(F706=2028,OR(F706=2032,OR(F706=2036,F706=2040)))))),AND(E706=\"Feb\",OR(F706=2044,OR(F706=2048,F706=2052)))),29,VLOOKUP(E706,Lookup!$B$2:$C$13,2,FALSE))","v":31},0,null,null,17]
[null,null,null,17,{"$f":"IF(E706=\"\",\"\",VLOOKUP(E706,Lookup!$A$2:$B$13,2,FALSE))","v":"Jun"},2038,null,null,null,null,null,null,null,null,null,null,null,null,null,null,null,null,null,null,null,null,null,null,null,null,{"$f":"IF(OR(AND(E707=\"Feb\",OR(F707=2020,OR(F707=2024,OR(F707=2028,OR(F707=2032,OR(F707=2036,F707=2040)))))),AND(E707=\"Feb\",OR(F707=2044,OR(F707=2048,F707=2052)))),29,VLOOKUP(E707,Lookup!$B$2:$C$13,2,FALSE))","v":30},0,null,null,17]
[null,null,null,17,{"$f":"IF(E707=\"\",\"\",VLOOKUP(E707,Lookup!$A$2:$B$13,2,FALSE))","v":"Jul"},2038,null,null,null,null,null,null,null,null,null,null,null,null,null,null,null,null,null,null,null,null,null,null,null,null,{"$f":"IF(OR(AND(E708=\"Feb\",OR(F708=2020,OR(F708=2024,OR(F708=2028,OR(F708=2032,OR(F708=2036,F708=2040)))))),AND(E708=\"Feb\",OR(F708=2044,OR(F708=2048,F708=2052)))),29,VLOOKUP(E708,Lookup!$B$2:$C$13,2,FALSE))","v":31},0,null,null,17]
[null,null,null,17,{"$f":"IF(E708=\"\",\"\",VLOOKUP(E708,Lookup!$A$2:$B$13,2,FALSE))","v":"Aug"},2038,null,null,null,null,null,null,null,null,null,null,null,null,null,null,null,null,null,null,null,null,null,null,null,null,{"$f":"IF(OR(AND(E709=\"Feb\",OR(F709=2020,OR(F709=2024,OR(F709=2028,OR(F709=2032,OR(F709=2036,F709=2040)))))),AND(E709=\"Feb\",OR(F709=2044,OR(F709=2048,F709=2052)))),29,VLOOKUP(E709,Lookup!$B$2:$C$13,2,FALSE))","v":31},0,null,null,17]
[null,null,null,17,{"$f":"IF(E709=\"\",\"\",VLOOKUP(E709,Lookup!$A$2:$B$13,2,FALSE))","v":"Sep"},2038,null,null,null,null,null,null,null,null,null,null,null,null,null,null,null,null,null,null,null,null,null,null,null,null,{"$f":"IF(OR(AND(E710=\"Feb\",OR(F710=2020,OR(F710=2024,OR(F710=2028,OR(F710=2032,OR(F710=2036,F710=2040)))))),AND(E710=\"Feb\",OR(F710=2044,OR(F710=2048,F710=2052)))),29,VLOOKUP(E710,Lookup!$B$2:$C$13,2,FALSE))","v":30},0,null,null,17]
[null,null,null,17,{"$f":"IF(E710=\"\",\"\",VLOOKUP(E710,Lookup!$A$2:$B$13,2,FALSE))","v":"Oct"},2038,null,null,null,null,null,null,null,null,null,null,null,null,null,null,null,null,null,null,null,null,null,null,null,null,{"$f":"IF(OR(AND(E711=\"Feb\",OR(F711=2020,OR(F711=2024,OR(F711=2028,OR(F711=2032,OR(F711=2036,F711=2040)))))),AND(E711=\"Feb\",OR(F711=2044,OR(F711=2048,F711=2052)))),29,VLOOKUP(E711,Lookup!$B$2:$C$13,2,FALSE))","v":31},0,null,null,17]
[null,null,null,17,{"$f":"IF(E711=\"\",\"\",VLOOKUP(E711,Lookup!$A$2:$B$13,2,FALSE))","v":"Nov"},2038,null,null,null,null,null,null,null,null,null,null,null,null,null,null,null,null,null,null,null,null,null,null,null,null,{"$f":"IF(OR(AND(E712=\"Feb\",OR(F712=2020,OR(F712=2024,OR(F712=2028,OR(F712=2032,OR(F712=2036,F712=2040)))))),AND(E712=\"Feb\",OR(F712=2044,OR(F712=2048,F712=2052)))),29,VLOOKUP(E712,Lookup!$B$2:$C$13,2,FALSE))","v":30},0,null,null,17]
[null,null,null,17,{"$f":"IF(E712=\"\",\"\",VLOOKUP(E712,Lookup!$A$2:$B$13,2,FALSE))","v":"Dec"},2038,null,null,null,null,null,null,null,null,null,null,null,null,null,null,null,null,null,null,null,null,null,null,null,null,{"$f":"IF(OR(AND(E713=\"Feb\",OR(F713=2020,OR(F713=2024,OR(F713=2028,OR(F713=2032,OR(F713=2036,F713=2040)))))),AND(E713=\"Feb\",OR(F713=2044,OR(F713=2048,F713=2052)))),29,VLOOKUP(E713,Lookup!$B$2:$C$13,2,FALSE))","v":31},0,null,null,17]
[null,null,null,18,{"$f":"IF(E713=\"\",\"\",VLOOKUP(E713,Lookup!$A$2:$B$13,2,FALSE))","v":"Jan"},2039,null,null,null,null,null,null,null,null,null,null,null,null,null,null,null,null,null,null,null,null,null,null,null,null,{"$f":"IF(OR(AND(E714=\"Feb\",OR(F714=2020,OR(F714=2024,OR(F714=2028,OR(F714=2032,OR(F714=2036,F714=2040)))))),AND(E714=\"Feb\",OR(F714=2044,OR(F714=2048,F714=2052)))),29,VLOOKUP(E714,Lookup!$B$2:$C$13,2,FALSE))","v":31},0,null,null,18]
[null,null,null,{"$f":"+D703+1","v":18},{"$f":"IF(E714=\"\",\"\",VLOOKUP(E714,Lookup!$A$2:$B$13,2,FALSE))","v":"Feb"},2039,null,null,null,null,null,null,null,null,null,null,null,null,null,null,null,null,null,null,null,null,null,null,null,null,{"$f":"IF(OR(AND(E715=\"Feb\",OR(F715=2020,OR(F715=2024,OR(F715=2028,OR(F715=2032,OR(F715=2036,F715=2040)))))),AND(E715=\"Feb\",OR(F715=2044,OR(F715=2048,F715=2052)))),29,VLOOKUP(E715,Lookup!$B$2:$C$13,2,FALSE))","v":28},0,null,null,18]
[null,null,null,18,{"$f":"IF(E715=\"\",\"\",VLOOKUP(E715,Lookup!$A$2:$B$13,2,FALSE))","v":"Mar"},2039,null,null,null,null,null,null,null,null,null,null,null,null,null,null,null,null,null,null,null,null,null,null,null,null,{"$f":"IF(OR(AND(E716=\"Feb\",OR(F716=2020,OR(F716=2024,OR(F716=2028,OR(F716=2032,OR(F716=2036,F716=2040)))))),AND(E716=\"Feb\",OR(F716=2044,OR(F716=2048,F716=2052)))),29,VLOOKUP(E716,Lookup!$B$2:$C$13,2,FALSE))","v":31},0,null,null,18]
[null,null,null,18,{"$f":"IF(E716=\"\",\"\",VLOOKUP(E716,Lookup!$A$2:$B$13,2,FALSE))","v":"Apr"},2039,null,null,null,null,null,null,null,null,null,null,null,null,null,null,null,null,null,null,null,null,null,null,null,null,{"$f":"IF(OR(AND(E717=\"Feb\",OR(F717=2020,OR(F717=2024,OR(F717=2028,OR(F717=2032,OR(F717=2036,F717=2040)))))),AND(E717=\"Feb\",OR(F717=2044,OR(F717=2048,F717=2052)))),29,VLOOKUP(E717,Lookup!$B$2:$C$13,2,FALSE))","v":30},0,null,null,18]
[null,null,null,18,{"$f":"IF(E717=\"\",\"\",VLOOKUP(E717,Lookup!$A$2:$B$13,2,FALSE))","v":"May"},2039,null,null,null,null,null,null,null,null,null,null,null,null,null,null,null,null,null,null,null,null,null,null,null,null,{"$f":"IF(OR(AND(E718=\"Feb\",OR(F718=2020,OR(F718=2024,OR(F718=2028,OR(F718=2032,OR(F718=2036,F718=2040)))))),AND(E718=\"Feb\",OR(F718=2044,OR(F718=2048,F718=2052)))),29,VLOOKUP(E718,Lookup!$B$2:$C$13,2,FALSE))","v":31},0,null,null,{"$f":"+D718","v":18}]
[null,null,null,18,{"$f":"IF(E718=\"\",\"\",VLOOKUP(E718,Lookup!$A$2:$B$13,2,FALSE))","v":"Jun"},2039,null,null,null,null,null,null,null,null,null,null,null,null,null,null,null,null,null,null,null,null,null,null,null,null,{"$f":"IF(OR(AND(E719=\"Feb\",OR(F719=2020,OR(F719=2024,OR(F719=2028,OR(F719=2032,OR(F719=2036,F719=2040)))))),AND(E719=\"Feb\",OR(F719=2044,OR(F719=2048,F719=2052)))),29,VLOOKUP(E719,Lookup!$B$2:$C$13,2,FALSE))","v":30},0,null,null,18]
[null,null,null,18,{"$f":"IF(E719=\"\",\"\",VLOOKUP(E719,Lookup!$A$2:$B$13,2,FALSE))","v":"Jul"},2039,null,null,null,null,null,null,null,null,null,null,null,null,null,null,null,null,null,null,null,null,null,null,null,null,{"$f":"IF(OR(AND(E720=\"Feb\",OR(F720=2020,OR(F720=2024,OR(F720=2028,OR(F720=2032,OR(F720=2036,F720=2040)))))),AND(E720=\"Feb\",OR(F720=2044,OR(F720=2048,F720=2052)))),29,VLOOKUP(E720,Lookup!$B$2:$C$13,2,FALSE))","v":31},0,null,null,18]
[null,null,null,18,{"$f":"IF(E720=\"\",\"\",VLOOKUP(E720,Lookup!$A$2:$B$13,2,FALSE))","v":"Aug"},2039,null,null,null,null,null,null,null,null,null,null,null,null,null,null,null,null,null,null,null,null,null,null,null,null,{"$f":"IF(OR(AND(E721=\"Feb\",OR(F721=2020,OR(F721=2024,OR(F721=2028,OR(F721=2032,OR(F721=2036,F721=2040)))))),AND(E721=\"Feb\",OR(F721=2044,OR(F721=2048,F721=2052)))),29,VLOOKUP(E721,Lookup!$B$2:$C$13,2,FALSE))","v":31},0,null,null,18]
[null,null,null,18,{"$f":"IF(E721=\"\",\"\",VLOOKUP(E721,Lookup!$A$2:$B$13,2,FALSE))","v":"Sep"},2039,null,null,null,null,null,null,null,null,null,null,null,null,null,null,null,null,null,null,null,null,null,null,null,null,{"$f":"IF(OR(AND(E722=\"Feb\",OR(F722=2020,OR(F722=2024,OR(F722=2028,OR(F722=2032,OR(F722=2036,F722=2040)))))),AND(E722=\"Feb\",OR(F722=2044,OR(F722=2048,F722=2052)))),29,VLOOKUP(E722,Lookup!$B$2:$C$13,2,FALSE))","v":30},0,null,null,18]
[null,null,null,18,{"$f":"IF(E722=\"\",\"\",VLOOKUP(E722,Lookup!$A$2:$B$13,2,FALSE))","v":"Oct"},2039,null,null,null,null,null,null,null,null,null,null,null,null,null,null,null,null,null,null,null,null,null,null,null,null,{"$f":"IF(OR(AND(E723=\"Feb\",OR(F723=2020,OR(F723=2024,OR(F723=2028,OR(F723=2032,OR(F723=2036,F723=2040)))))),AND(E723=\"Feb\",OR(F723=2044,OR(F723=2048,F723=2052)))),29,VLOOKUP(E723,Lookup!$B$2:$C$13,2,FALSE))","v":31},0,null,null,18]
[null,null,null,18,{"$f":"IF(E723=\"\",\"\",VLOOKUP(E723,Lookup!$A$2:$B$13,2,FALSE))","v":"Nov"},2039,null,null,null,null,null,null,null,null,null,null,null,null,null,null,null,null,null,null,null,null,null,null,null,null,{"$f":"IF(OR(AND(E724=\"Feb\",OR(F724=2020,OR(F724=2024,OR(F724=2028,OR(F724=2032,OR(F724=2036,F724=2040)))))),AND(E724=\"Feb\",OR(F724=2044,OR(F724=2048,F724=2052)))),29,VLOOKUP(E724,Lookup!$B$2:$C$13,2,FALSE))","v":30},0,null,null,18]
[null,null,null,18,{"$f":"IF(E724=\"\",\"\",VLOOKUP(E724,Lookup!$A$2:$B$13,2,FALSE))","v":"Dec"},2039,null,null,null,null,null,null,null,null,null,null,null,null,null,null,null,null,null,null,null,null,null,null,null,null,{"$f":"IF(OR(AND(E725=\"Feb\",OR(F725=2020,OR(F725=2024,OR(F725=2028,OR(F725=2032,OR(F725=2036,F725=2040)))))),AND(E725=\"Feb\",OR(F725=2044,OR(F725=2048,F725=2052)))),29,VLOOKUP(E725,Lookup!$B$2:$C$13,2,FALSE))","v":31},0,null,null,18]
[null,null,null,19,{"$f":"IF(E725=\"\",\"\",VLOOKUP(E725,Lookup!$A$2:$B$13,2,FALSE))","v":"Jan"},2040,null,null,null,null,null,null,null,null,null,null,null,null,null,null,null,null,null,null,null,null,null,null,null,null,{"$f":"IF(OR(AND(E726=\"Feb\",OR(F726=2020,OR(F726=2024,OR(F726=2028,OR(F726=2032,OR(F726=2036,F726=2040)))))),AND(E726=\"Feb\",OR(F726=2044,OR(F726=2048,F726=2052)))),29,VLOOKUP(E726,Lookup!$B$2:$C$13,2,FALSE))","v":31},0,null,null,19]
[null,null,null,19,{"$f":"IF(E726=\"\",\"\",VLOOKUP(E726,Lookup!$A$2:$B$13,2,FALSE))","v":"Feb"},2040,null,null,null,null,null,null,null,null,null,null,null,null,null,null,null,null,null,null,null,null,null,null,null,null,{"$f":"IF(OR(AND(E727=\"Feb\",OR(F727=2020,OR(F727=2024,OR(F727=2028,OR(F727=2032,OR(F727=2036,F727=2040)))))),AND(E727=\"Feb\",OR(F727=2044,OR(F727=2048,F727=2052)))),29,VLOOKUP(E727,Lookup!$B$2:$C$13,2,FALSE))","v":29},0,null,null,{"$f":"+D727","v":19}]
[null,null,null,19,{"$f":"IF(E727=\"\",\"\",VLOOKUP(E727,Lookup!$A$2:$B$13,2,FALSE))","v":"Mar"},2040,null,null,null,null,null,null,null,null,null,null,null,null,null,null,null,null,null,null,null,null,null,null,null,null,{"$f":"IF(OR(AND(E728=\"Feb\",OR(F728=2020,OR(F728=2024,OR(F728=2028,OR(F728=2032,OR(F728=2036,F728=2040)))))),AND(E728=\"Feb\",OR(F728=2044,OR(F728=2048,F728=2052)))),29,VLOOKUP(E728,Lookup!$B$2:$C$13,2,FALSE))","v":31},0,null,null,19]
[null,null,null,19,{"$f":"IF(E728=\"\",\"\",VLOOKUP(E728,Lookup!$A$2:$B$13,2,FALSE))","v":"Apr"},2040,null,null,null,null,null,null,null,null,null,null,null,null,null,null,null,null,null,null,null,null,null,null,null,null,{"$f":"IF(OR(AND(E729=\"Feb\",OR(F729=2020,OR(F729=2024,OR(F729=2028,OR(F729=2032,OR(F729=2036,F729=2040)))))),AND(E729=\"Feb\",OR(F729=2044,OR(F729=2048,F729=2052)))),29,VLOOKUP(E729,Lookup!$B$2:$C$13,2,FALSE))","v":30},0,null,null,19]
[null,null,null,19,{"$f":"IF(E729=\"\",\"\",VLOOKUP(E729,Lookup!$A$2:$B$13,2,FALSE))","v":"May"},2040,null,null,null,null,null,null,null,null,null,null,null,null,null,null,null,null,null,null,null,null,null,null,null,null,{"$f":"IF(OR(AND(E730=\"Feb\",OR(F730=2020,OR(F730=2024,OR(F730=2028,OR(F730=2032,OR(F730=2036,F730=2040)))))),AND(E730=\"Feb\",OR(F730=2044,OR(F730=2048,F730=2052)))),29,VLOOKUP(E730,Lookup!$B$2:$C$13,2,FALSE))","v":31},0,null,null,19]
[null,null,null,19,{"$f":"IF(E730=\"\",\"\",VLOOKUP(E730,Lookup!$A$2:$B$13,2,FALSE))","v":"Jun"},2040,null,null,null,null,null,null,null,null,null,null,null,null,null,null,null,null,null,null,null,null,null,null,null,null,{"$f":"IF(OR(AND(E731=\"Feb\",OR(F731=2020,OR(F731=2024,OR(F731=2028,OR(F731=2032,OR(F731=2036,F731=2040)))))),AND(E731=\"Feb\",OR(F731=2044,OR(F731=2048,F731=2052)))),29,VLOOKUP(E731,Lookup!$B$2:$C$13,2,FALSE))","v":30},0,null,null,19]
[null,null,null,19,{"$f":"IF(E731=\"\",\"\",VLOOKUP(E731,Lookup!$A$2:$B$13,2,FALSE))","v":"Jul"},2040,null,null,null,null,null,null,null,null,null,null,null,null,null,null,null,null,null,null,null,null,null,null,null,null,{"$f":"IF(OR(AND(E732=\"Feb\",OR(F732=2020,OR(F732=2024,OR(F732=2028,OR(F732=2032,OR(F732=2036,F732=2040)))))),AND(E732=\"Feb\",OR(F732=2044,OR(F732=2048,F732=2052)))),29,VLOOKUP(E732,Lookup!$B$2:$C$13,2,FALSE))","v":31},0,null,null,19]
[null,null,null,19,{"$f":"IF(E732=\"\",\"\",VLOOKUP(E732,Lookup!$A$2:$B$13,2,FALSE))","v":"Aug"},2040,null,null,null,null,null,null,null,null,null,null,null,null,null,null,null,null,null,null,null,null,null,null,null,null,{"$f":"IF(OR(AND(E733=\"Feb\",OR(F733=2020,OR(F733=2024,OR(F733=2028,OR(F733=2032,OR(F733=2036,F733=2040)))))),AND(E733=\"Feb\",OR(F733=2044,OR(F733=2048,F733=2052)))),29,VLOOKUP(E733,Lookup!$B$2:$C$13,2,FALSE))","v":31},0,null,null,19]
[null,null,null,19,{"$f":"IF(E733=\"\",\"\",VLOOKUP(E733,Lookup!$A$2:$B$13,2,FALSE))","v":"Sep"},2040,null,null,null,null,null,null,null,null,null,null,null,null,null,null,null,null,null,null,null,null,null,null,null,null,{"$f":"IF(OR(AND(E734=\"Feb\",OR(F734=2020,OR(F734=2024,OR(F734=2028,OR(F734=2032,OR(F734=2036,F734=2040)))))),AND(E734=\"Feb\",OR(F734=2044,OR(F734=2048,F734=2052)))),29,VLOOKUP(E734,Lookup!$B$2:$C$13,2,FALSE))","v":30},0,null,null,19]
[null,null,null,19,{"$f":"IF(E734=\"\",\"\",VLOOKUP(E734,Lookup!$A$2:$B$13,2,FALSE))","v":"Oct"},2040,null,null,null,null,null,null,null,null,null,null,null,null,null,null,null,null,null,null,null,null,null,null,null,null,{"$f":"IF(OR(AND(E735=\"Feb\",OR(F735=2020,OR(F735=2024,OR(F735=2028,OR(F735=2032,OR(F735=2036,F735=2040)))))),AND(E735=\"Feb\",OR(F735=2044,OR(F735=2048,F735=2052)))),29,VLOOKUP(E735,Lookup!$B$2:$C$13,2,FALSE))","v":31},0,null,null,19]
[null,null,null,19,{"$f":"IF(E735=\"\",\"\",VLOOKUP(E735,Lookup!$A$2:$B$13,2,FALSE))","v":"Nov"},2040,null,null,null,null,null,null,null,null,null,null,null,null,null,null,null,null,null,null,null,null,null,null,null,null,{"$f":"IF(OR(AND(E736=\"Feb\",OR(F736=2020,OR(F736=2024,OR(F736=2028,OR(F736=2032,OR(F736=2036,F736=2040)))))),AND(E736=\"Feb\",OR(F736=2044,OR(F736=2048,F736=2052)))),29,VLOOKUP(E736,Lookup!$B$2:$C$13,2,FALSE))","v":30},0,null,null,19]
[null,null,null,19,{"$f":"IF(E736=\"\",\"\",VLOOKUP(E736,Lookup!$A$2:$B$13,2,FALSE))","v":"Dec"},2040,null,null,null,null,null,null,null,null,null,null,null,null,null,null,null,null,null,null,null,null,null,null,null,null,{"$f":"IF(OR(AND(E737=\"Feb\",OR(F737=2020,OR(F737=2024,OR(F737=2028,OR(F737=2032,OR(F737=2036,F737=2040)))))),AND(E737=\"Feb\",OR(F737=2044,OR(F737=2048,F737=2052)))),29,VLOOKUP(E737,Lookup!$B$2:$C$13,2,FALSE))","v":31},0,null,null,19]
[null,null,null,20,{"$f":"IF(E737=\"\",\"\",VLOOKUP(E737,Lookup!$A$2:$B$13,2,FALSE))","v":"Jan"},2041,null,null,null,null,null,null,null,null,null,null,null,null,null,null,null,null,null,null,null,null,null,null,null,null,{"$f":"IF(OR(AND(E738=\"Feb\",OR(F738=2020,OR(F738=2024,OR(F738=2028,OR(F738=2032,OR(F738=2036,F738=2040)))))),AND(E738=\"Feb\",OR(F738=2044,OR(F738=2048,F738=2052)))),29,VLOOKUP(E738,Lookup!$B$2:$C$13,2,FALSE))","v":31},0,null,null,20]
[null,null,null,20,{"$f":"IF(E738=\"\",\"\",VLOOKUP(E738,Lookup!$A$2:$B$13,2,FALSE))","v":"Feb"},2041,null,null,null,null,null,null,null,null,null,null,null,null,null,null,null,null,null,null,null,null,null,null,null,null,{"$f":"IF(OR(AND(E739=\"Feb\",OR(F739=2020,OR(F739=2024,OR(F739=2028,OR(F739=2032,OR(F739=2036,F739=2040)))))),AND(E739=\"Feb\",OR(F739=2044,OR(F739=2048,F739=2052)))),29,VLOOKUP(E739,Lookup!$B$2:$C$13,2,FALSE))","v":28},0,null,null,20]
[null,null,null,20,{"$f":"IF(E739=\"\",\"\",VLOOKUP(E739,Lookup!$A$2:$B$13,2,FALSE))","v":"Mar"},2041,null,null,null,null,null,null,null,null,null,null,null,null,null,null,null,null,null,null,null,null,null,null,null,null,{"$f":"IF(OR(AND(E740=\"Feb\",OR(F740=2020,OR(F740=2024,OR(F740=2028,OR(F740=2032,OR(F740=2036,F740=2040)))))),AND(E740=\"Feb\",OR(F740=2044,OR(F740=2048,F740=2052)))),29,VLOOKUP(E740,Lookup!$B$2:$C$13,2,FALSE))","v":31},0,null,null,20]
[null,null,null,20,{"$f":"IF(E740=\"\",\"\",VLOOKUP(E740,Lookup!$A$2:$B$13,2,FALSE))","v":"Apr"},2041,null,null,null,null,null,null,null,null,null,null,null,null,null,null,null,null,null,null,null,null,null,null,null,null,{"$f":"IF(OR(AND(E741=\"Feb\",OR(F741=2020,OR(F741=2024,OR(F741=2028,OR(F741=2032,OR(F741=2036,F741=2040)))))),AND(E741=\"Feb\",OR(F741=2044,OR(F741=2048,F741=2052)))),29,VLOOKUP(E741,Lookup!$B$2:$C$13,2,FALSE))","v":30},0,null,null,20]
[null,null,null,20,{"$f":"IF(E741=\"\",\"\",VLOOKUP(E741,Lookup!$A$2:$B$13,2,FALSE))","v":"May"},2041,null,null,null,null,null,null,null,null,null,null,null,null,null,null,null,null,null,null,null,null,null,null,null,null,{"$f":"IF(OR(AND(E742=\"Feb\",OR(F742=2020,OR(F742=2024,OR(F742=2028,OR(F742=2032,OR(F742=2036,F742=2040)))))),AND(E742=\"Feb\",OR(F742=2044,OR(F742=2048,F742=2052)))),29,VLOOKUP(E742,Lookup!$B$2:$C$13,2,FALSE))","v":31},0,null,null,20]
[null,null,null,20,{"$f":"IF(E742=\"\",\"\",VLOOKUP(E742,Lookup!$A$2:$B$13,2,FALSE))","v":"Jun"},2041,null,null,null,null,null,null,null,null,null,null,null,null,null,null,null,null,null,null,null,null,null,null,null,null,{"$f":"IF(OR(AND(E743=\"Feb\",OR(F743=2020,OR(F743=2024,OR(F743=2028,OR(F743=2032,OR(F743=2036,F743=2040)))))),AND(E743=\"Feb\",OR(F743=2044,OR(F743=2048,F743=2052)))),29,VLOOKUP(E743,Lookup!$B$2:$C$13,2,FALSE))","v":30},0,null,null,20]
[null,null,null,20,{"$f":"IF(E743=\"\",\"\",VLOOKUP(E743,Lookup!$A$2:$B$13,2,FALSE))","v":"Jul"},2041,null,null,null,null,null,null,null,null,null,null,null,null,null,null,null,null,null,null,null,null,null,null,null,null,{"$f":"IF(OR(AND(E744=\"Feb\",OR(F744=2020,OR(F744=2024,OR(F744=2028,OR(F744=2032,OR(F744=2036,F744=2040)))))),AND(E744=\"Feb\",OR(F744=2044,OR(F744=2048,F744=2052)))),29,VLOOKUP(E744,Lookup!$B$2:$C$13,2,FALSE))","v":31},0,null,null,20]
[null,null,null,20,{"$f":"IF(E744=\"\",\"\",VLOOKUP(E744,Lookup!$A$2:$B$13,2,FALSE))","v":"Aug"},2041,null,null,null,null,null,null,null,null,null,null,null,null,null,null,null,null,null,null,null,null,null,null,null,null,{"$f":"IF(OR(AND(E745=\"Feb\",OR(F745=2020,OR(F745=2024,OR(F745=2028,OR(F745=2032,OR(F745=2036,F745=2040)))))),AND(E745=\"Feb\",OR(F745=2044,OR(F745=2048,F745=2052)))),29,VLOOKUP(E745,Lookup!$B$2:$C$13,2,FALSE))","v":31},0,null,null,20]
[null,null,null,20,{"$f":"IF(E745=\"\",\"\",VLOOKUP(E745,Lookup!$A$2:$B$13,2,FALSE))","v":"Sep"},2041,null,null,null,null,null,null,null,null,null,null,null,null,null,null,null,null,null,null,null,null,null,null,null,null,{"$f":"IF(OR(AND(E746=\"Feb\",OR(F746=2020,OR(F746=2024,OR(F746=2028,OR(F746=2032,OR(F746=2036,F746=2040)))))),AND(E746=\"Feb\",OR(F746=2044,OR(F746=2048,F746=2052)))),29,VLOOKUP(E746,Lookup!$B$2:$C$13,2,FALSE))","v":30},0,null,null,20]
[null,null,null,20,{"$f":"IF(E746=\"\",\"\",VLOOKUP(E746,Lookup!$A$2:$B$13,2,FALSE))","v":"Oct"},2041,null,null,null,null,null,null,null,null,null,null,null,null,null,null,null,null,null,null,null,null,null,null,null,null,{"$f":"IF(OR(AND(E747=\"Feb\",OR(F747=2020,OR(F747=2024,OR(F747=2028,OR(F747=2032,OR(F747=2036,F747=2040)))))),AND(E747=\"Feb\",OR(F747=2044,OR(F747=2048,F747=2052)))),29,VLOOKUP(E747,Lookup!$B$2:$C$13,2,FALSE))","v":31},0,null,null,20]
[null,null,null,20,{"$f":"IF(E747=\"\",\"\",VLOOKUP(E747,Lookup!$A$2:$B$13,2,FALSE))","v":"Nov"},2041,null,null,null,null,null,null,null,null,null,null,null,null,null,null,null,null,null,null,null,null,null,null,null,null,{"$f":"IF(OR(AND(E748=\"Feb\",OR(F748=2020,OR(F748=2024,OR(F748=2028,OR(F748=2032,OR(F748=2036,F748=2040)))))),AND(E748=\"Feb\",OR(F748=2044,OR(F748=2048,F748=2052)))),29,VLOOKUP(E748,Lookup!$B$2:$C$13,2,FALSE))","v":30},0,null,null,20]
[null,null,null,20,{"$f":"IF(E748=\"\",\"\",VLOOKUP(E748,Lookup!$A$2:$B$13,2,FALSE))","v":"Dec"},2041,null,null,null,null,null,null,null,null,null,null,null,null,null,null,null,null,null,null,null,null,null,null,null,null,{"$f":"IF(OR(AND(E749=\"Feb\",OR(F749=2020,OR(F749=2024,OR(F749=2028,OR(F749=2032,OR(F749=2036,F749=2040)))))),AND(E749=\"Feb\",OR(F749=2044,OR(F749=2048,F749=2052)))),29,VLOOKUP(E749,Lookup!$B$2:$C$13,2,FALSE))","v":31},0,null,null,20]
[null,null,null,21,{"$f":"IF(E749=\"\",\"\",VLOOKUP(E749,Lookup!$A$2:$B$13,2,FALSE))","v":"Jan"},2042,null,null,null,null,null,null,null,null,null,null,null,null,null,null,null,null,null,null,null,null,null,null,null,null,{"$f":"IF(OR(AND(E750=\"Feb\",OR(F750=2020,OR(F750=2024,OR(F750=2028,OR(F750=2032,OR(F750=2036,F750=2040)))))),AND(E750=\"Feb\",OR(F750=2044,OR(F750=2048,F750=2052)))),29,VLOOKUP(E750,Lookup!$B$2:$C$13,2,FALSE))","v":31},0,null,null,{"$f":"+D750","v":21}]
[null,null,null,21,{"$f":"IF(E750=\"\",\"\",VLOOKUP(E750,Lookup!$A$2:$B$13,2,FALSE))","v":"Feb"},2042,null,null,null,null,null,null,null,null,null,null,null,null,null,null,null,null,null,null,null,null,null,null,null,null,{"$f":"IF(OR(AND(E751=\"Feb\",OR(F751=2020,OR(F751=2024,OR(F751=2028,OR(F751=2032,OR(F751=2036,F751=2040)))))),AND(E751=\"Feb\",OR(F751=2044,OR(F751=2048,F751=2052)))),29,VLOOKUP(E751,Lookup!$B$2:$C$13,2,FALSE))","v":28},0,null,null,{"$f":"+D751","v":21}]
[null,null,null,21,{"$f":"IF(E751=\"\",\"\",VLOOKUP(E751,Lookup!$A$2:$B$13,2,FALSE))","v":"Mar"},2042,null,null,null,null,null,null,null,null,null,null,null,null,null,null,null,null,null,null,null,null,null,null,null,null,{"$f":"IF(OR(AND(E752=\"Feb\",OR(F752=2020,OR(F752=2024,OR(F752=2028,OR(F752=2032,OR(F752=2036,F752=2040)))))),AND(E752=\"Feb\",OR(F752=2044,OR(F752=2048,F752=2052)))),29,VLOOKUP(E752,Lookup!$B$2:$C$13,2,FALSE))","v":31},0,null,null,21]
[null,null,null,21,{"$f":"IF(E752=\"\",\"\",VLOOKUP(E752,Lookup!$A$2:$B$13,2,FALSE))","v":"Apr"},2042,null,null,null,null,null,null,null,null,null,null,null,null,null,null,null,null,null,null,null,null,null,null,null,null,{"$f":"IF(OR(AND(E753=\"Feb\",OR(F753=2020,OR(F753=2024,OR(F753=2028,OR(F753=2032,OR(F753=2036,F753=2040)))))),AND(E753=\"Feb\",OR(F753=2044,OR(F753=2048,F753=2052)))),29,VLOOKUP(E753,Lookup!$B$2:$C$13,2,FALSE))","v":30},0,null,null,21]
[null,null,null,21,{"$f":"IF(E753=\"\",\"\",VLOOKUP(E753,Lookup!$A$2:$B$13,2,FALSE))","v":"May"},2042,null,null,null,null,null,null,null,null,null,null,null,null,null,null,null,null,null,null,null,null,null,null,null,null,{"$f":"IF(OR(AND(E754=\"Feb\",OR(F754=2020,OR(F754=2024,OR(F754=2028,OR(F754=2032,OR(F754=2036,F754=2040)))))),AND(E754=\"Feb\",OR(F754=2044,OR(F754=2048,F754=2052)))),29,VLOOKUP(E754,Lookup!$B$2:$C$13,2,FALSE))","v":31},0,null,null,21]
[null,null,null,21,{"$f":"IF(E754=\"\",\"\",VLOOKUP(E754,Lookup!$A$2:$B$13,2,FALSE))","v":"Jun"},2042,null,null,null,null,null,null,null,null,null,null,null,null,null,null,null,null,null,null,null,null,null,null,null,null,{"$f":"IF(OR(AND(E755=\"Feb\",OR(F755=2020,OR(F755=2024,OR(F755=2028,OR(F755=2032,OR(F755=2036,F755=2040)))))),AND(E755=\"Feb\",OR(F755=2044,OR(F755=2048,F755=2052)))),29,VLOOKUP(E755,Lookup!$B$2:$C$13,2,FALSE))","v":30},0,null,null,21]
[null,null,null,21,{"$f":"IF(E755=\"\",\"\",VLOOKUP(E755,Lookup!$A$2:$B$13,2,FALSE))","v":"Jul"},2042,null,null,null,null,null,null,null,null,null,null,null,null,null,null,null,null,null,null,null,null,null,null,null,null,{"$f":"IF(OR(AND(E756=\"Feb\",OR(F756=2020,OR(F756=2024,OR(F756=2028,OR(F756=2032,OR(F756=2036,F756=2040)))))),AND(E756=\"Feb\",OR(F756=2044,OR(F756=2048,F756=2052)))),29,VLOOKUP(E756,Lookup!$B$2:$C$13,2,FALSE))","v":31},0,null,null,21]
[null,null,null,21,{"$f":"IF(E756=\"\",\"\",VLOOKUP(E756,Lookup!$A$2:$B$13,2,FALSE))","v":"Aug"},2042,null,null,null,null,null,null,null,null,null,null,null,null,null,null,null,null,null,null,null,null,null,null,null,null,{"$f":"IF(OR(AND(E757=\"Feb\",OR(F757=2020,OR(F757=2024,OR(F757=2028,OR(F757=2032,OR(F757=2036,F757=2040)))))),AND(E757=\"Feb\",OR(F757=2044,OR(F757=2048,F757=2052)))),29,VLOOKUP(E757,Lookup!$B$2:$C$13,2,FALSE))","v":31},0,null,null,21]
[null,null,null,21,{"$f":"IF(E757=\"\",\"\",VLOOKUP(E757,Lookup!$A$2:$B$13,2,FALSE))","v":"Sep"},2042,null,null,null,null,null,null,null,null,null,null,null,null,null,null,null,null,null,null,null,null,null,null,null,null,{"$f":"IF(OR(AND(E758=\"Feb\",OR(F758=2020,OR(F758=2024,OR(F758=2028,OR(F758=2032,OR(F758=2036,F758=2040)))))),AND(E758=\"Feb\",OR(F758=2044,OR(F758=2048,F758=2052)))),29,VLOOKUP(E758,Lookup!$B$2:$C$13,2,FALSE))","v":30},0,null,null,21]
[null,null,null,21,{"$f":"IF(E758=\"\",\"\",VLOOKUP(E758,Lookup!$A$2:$B$13,2,FALSE))","v":"Oct"},2042,null,null,null,null,null,null,null,null,null,null,null,null,null,null,null,null,null,null,null,null,null,null,null,null,{"$f":"IF(OR(AND(E759=\"Feb\",OR(F759=2020,OR(F759=2024,OR(F759=2028,OR(F759=2032,OR(F759=2036,F759=2040)))))),AND(E759=\"Feb\",OR(F759=2044,OR(F759=2048,F759=2052)))),29,VLOOKUP(E759,Lookup!$B$2:$C$13,2,FALSE))","v":31},0,null,null,21]
[null,null,null,21,{"$f":"IF(E759=\"\",\"\",VLOOKUP(E759,Lookup!$A$2:$B$13,2,FALSE))","v":"Nov"},2042,null,null,null,null,null,null,null,null,null,null,null,null,null,null,null,null,null,null,null,null,null,null,null,null,{"$f":"IF(OR(AND(E760=\"Feb\",OR(F760=2020,OR(F760=2024,OR(F760=2028,OR(F760=2032,OR(F760=2036,F760=2040)))))),AND(E760=\"Feb\",OR(F760=2044,OR(F760=2048,F760=2052)))),29,VLOOKUP(E760,Lookup!$B$2:$C$13,2,FALSE))","v":30},0,null,null,21]
[null,null,null,21,{"$f":"IF(E760=\"\",\"\",VLOOKUP(E760,Lookup!$A$2:$B$13,2,FALSE))","v":"Dec"},2042,null,null,null,null,null,null,null,null,null,null,null,null,null,null,null,null,null,null,null,null,null,null,null,null,{"$f":"IF(OR(AND(E761=\"Feb\",OR(F761=2020,OR(F761=2024,OR(F761=2028,OR(F761=2032,OR(F761=2036,F761=2040)))))),AND(E761=\"Feb\",OR(F761=2044,OR(F761=2048,F761=2052)))),29,VLOOKUP(E761,Lookup!$B$2:$C$13,2,FALSE))","v":31},0,null,null,21]
[null,null,null,22,{"$f":"IF(E761=\"\",\"\",VLOOKUP(E761,Lookup!$A$2:$B$13,2,FALSE))","v":"Jan"},2043,null,null,null,null,null,null,null,null,null,null,null,null,null,null,null,null,null,null,null,null,null,null,null,null,{"$f":"IF(OR(AND(E762=\"Feb\",OR(F762=2020,OR(F762=2024,OR(F762=2028,OR(F762=2032,OR(F762=2036,F762=2040)))))),AND(E762=\"Feb\",OR(F762=2044,OR(F762=2048,F762=2052)))),29,VLOOKUP(E762,Lookup!$B$2:$C$13,2,FALSE))","v":31},0,null,null,22]
[null,null,null,22,{"$f":"IF(E762=\"\",\"\",VLOOKUP(E762,Lookup!$A$2:$B$13,2,FALSE))","v":"Feb"},2043,null,null,null,null,null,null,null,null,null,null,null,null,null,null,null,null,null,null,null,null,null,null,null,null,{"$f":"IF(OR(AND(E763=\"Feb\",OR(F763=2020,OR(F763=2024,OR(F763=2028,OR(F763=2032,OR(F763=2036,F763=2040)))))),AND(E763=\"Feb\",OR(F763=2044,OR(F763=2048,F763=2052)))),29,VLOOKUP(E763,Lookup!$B$2:$C$13,2,FALSE))","v":28},0,null,null,22]
[null,null,null,22,{"$f":"IF(E763=\"\",\"\",VLOOKUP(E763,Lookup!$A$2:$B$13,2,FALSE))","v":"Mar"},2043,null,null,null,null,null,null,null,null,null,null,null,null,null,null,null,null,null,null,null,null,null,null,null,null,{"$f":"IF(OR(AND(E764=\"Feb\",OR(F764=2020,OR(F764=2024,OR(F764=2028,OR(F764=2032,OR(F764=2036,F764=2040)))))),AND(E764=\"Feb\",OR(F764=2044,OR(F764=2048,F764=2052)))),29,VLOOKUP(E764,Lookup!$B$2:$C$13,2,FALSE))","v":31},0,null,null,22]
[null,null,null,22,{"$f":"IF(E764=\"\",\"\",VLOOKUP(E764,Lookup!$A$2:$B$13,2,FALSE))","v":"Apr"},2043,null,null,null,null,null,null,null,null,null,null,null,null,null,null,null,null,null,null,null,null,null,null,null,null,{"$f":"IF(OR(AND(E765=\"Feb\",OR(F765=2020,OR(F765=2024,OR(F765=2028,OR(F765=2032,OR(F765=2036,F765=2040)))))),AND(E765=\"Feb\",OR(F765=2044,OR(F765=2048,F765=2052)))),29,VLOOKUP(E765,Lookup!$B$2:$C$13,2,FALSE))","v":30},0,null,null,22]
[null,null,null,22,{"$f":"IF(E765=\"\",\"\",VLOOKUP(E765,Lookup!$A$2:$B$13,2,FALSE))","v":"May"},2043,null,null,null,null,null,null,null,null,null,null,null,null,null,null,null,null,null,null,null,null,null,null,null,null,{"$f":"IF(OR(AND(E766=\"Feb\",OR(F766=2020,OR(F766=2024,OR(F766=2028,OR(F766=2032,OR(F766=2036,F766=2040)))))),AND(E766=\"Feb\",OR(F766=2044,OR(F766=2048,F766=2052)))),29,VLOOKUP(E766,Lookup!$B$2:$C$13,2,FALSE))","v":31},{"$f":"SUM(G766:AD766)*AE766","v":0},null,null,22]
[null,null,null,22,{"$f":"IF(E766=\"\",\"\",VLOOKUP(E766,Lookup!$A$2:$B$13,2,FALSE))","v":"Jun"},{"$f":"IF(E766=0,\"\",IF(E766=\"Dec\",F766+1,F766))","v":2043},null,null,null,null,null,null,null,null,null,null,null,null,null,null,null,null,null,null,null,null,null,null,null,null,{"$f":"IF(OR(AND(E767=\"Feb\",OR(F767=2020,OR(F767=2024,OR(F767=2028,OR(F767=2032,OR(F767=2036,F767=2040)))))),AND(E767=\"Feb\",OR(F767=2044,OR(F767=2048,F767=2052)))),29,VLOOKUP(E767,Lookup!$B$2:$C$13,2,FALSE))","v":30},0,null,null,22]
[null,null,null,22,{"$f":"IF(E767=\"\",\"\",VLOOKUP(E767,Lookup!$A$2:$B$13,2,FALSE))","v":"Jul"},2043,null,null,null,null,null,null,null,null,null,null,null,null,null,null,null,null,null,null,null,null,null,null,null,null,{"$f":"IF(OR(AND(E768=\"Feb\",OR(F768=2020,OR(F768=2024,OR(F768=2028,OR(F768=2032,OR(F768=2036,F768=2040)))))),AND(E768=\"Feb\",OR(F768=2044,OR(F768=2048,F768=2052)))),29,VLOOKUP(E768,Lookup!$B$2:$C$13,2,FALSE))","v":31},0,null,null,22]
[null,null,null,22,{"$f":"IF(E768=\"\",\"\",VLOOKUP(E768,Lookup!$A$2:$B$13,2,FALSE))","v":"Aug"},2043,null,null,null,null,null,null,null,null,null,null,null,null,null,null,null,null,null,null,null,null,null,null,null,null,{"$f":"IF(OR(AND(E769=\"Feb\",OR(F769=2020,OR(F769=2024,OR(F769=2028,OR(F769=2032,OR(F769=2036,F769=2040)))))),AND(E769=\"Feb\",OR(F769=2044,OR(F769=2048,F769=2052)))),29,VLOOKUP(E769,Lookup!$B$2:$C$13,2,FALSE))","v":31},0,null,null,22]
[null,null,null,22,{"$f":"IF(E769=\"\",\"\",VLOOKUP(E769,Lookup!$A$2:$B$13,2,FALSE))","v":"Sep"},2043,null,null,null,null,null,null,null,null,null,null,null,null,null,null,null,null,null,null,null,null,null,null,null,null,{"$f":"IF(OR(AND(E770=\"Feb\",OR(F770=2020,OR(F770=2024,OR(F770=2028,OR(F770=2032,OR(F770=2036,F770=2040)))))),AND(E770=\"Feb\",OR(F770=2044,OR(F770=2048,F770=2052)))),29,VLOOKUP(E770,Lookup!$B$2:$C$13,2,FALSE))","v":30},0,null,null,22]
[null,null,null,22,{"$f":"IF(E770=\"\",\"\",VLOOKUP(E770,Lookup!$A$2:$B$13,2,FALSE))","v":"Oct"},2043,null,null,null,null,null,null,null,null,null,null,null,null,null,null,null,null,null,null,null,null,null,null,null,null,{"$f":"IF(OR(AND(E771=\"Feb\",OR(F771=2020,OR(F771=2024,OR(F771=2028,OR(F771=2032,OR(F771=2036,F771=2040)))))),AND(E771=\"Feb\",OR(F771=2044,OR(F771=2048,F771=2052)))),29,VLOOKUP(E771,Lookup!$B$2:$C$13,2,FALSE))","v":31},0,null,null,22]
[null,null,null,22,{"$f":"IF(E771=\"\",\"\",VLOOKUP(E771,Lookup!$A$2:$B$13,2,FALSE))","v":"Nov"},2043,null,null,null,null,null,null,null,null,null,null,null,null,null,null,null,null,null,null,null,null,null,null,null,null,{"$f":"IF(OR(AND(E772=\"Feb\",OR(F772=2020,OR(F772=2024,OR(F772=2028,OR(F772=2032,OR(F772=2036,F772=2040)))))),AND(E772=\"Feb\",OR(F772=2044,OR(F772=2048,F772=2052)))),29,VLOOKUP(E772,Lookup!$B$2:$C$13,2,FALSE))","v":30},0,null,null,22]
[null,null,null,22,{"$f":"IF(E772=\"\",\"\",VLOOKUP(E772,Lookup!$A$2:$B$13,2,FALSE))","v":"Dec"},2043,null,null,null,null,null,null,null,null,null,null,null,null,null,null,null,null,null,null,null,null,null,null,null,null,{"$f":"IF(OR(AND(E773=\"Feb\",OR(F773=2020,OR(F773=2024,OR(F773=2028,OR(F773=2032,OR(F773=2036,F773=2040)))))),AND(E773=\"Feb\",OR(F773=2044,OR(F773=2048,F773=2052)))),29,VLOOKUP(E773,Lookup!$B$2:$C$13,2,FALSE))","v":31},0,null,null,22]
[null,null,null,23,{"$f":"IF(E773=\"\",\"\",VLOOKUP(E773,Lookup!$A$2:$B$13,2,FALSE))","v":"Jan"},2044,null,null,null,null,null,null,null,null,null,null,null,null,null,null,null,null,null,null,null,null,null,null,null,null,{"$f":"IF(OR(AND(E774=\"Feb\",OR(F774=2020,OR(F774=2024,OR(F774=2028,OR(F774=2032,OR(F774=2036,F774=2040)))))),AND(E774=\"Feb\",OR(F774=2044,OR(F774=2048,F774=2052)))),29,VLOOKUP(E774,Lookup!$B$2:$C$13,2,FALSE))","v":31},0,null,null,{"$f":"+D774","v":23}]
[null,null,null,23,{"$f":"IF(E774=\"\",\"\",VLOOKUP(E774,Lookup!$A$2:$B$13,2,FALSE))","v":"Feb"},2044,null,null,null,null,null,null,null,null,null,null,null,null,null,null,null,null,null,null,null,null,null,null,null,null,{"$f":"IF(OR(AND(E775=\"Feb\",OR(F775=2020,OR(F775=2024,OR(F775=2028,OR(F775=2032,OR(F775=2036,F775=2040)))))),AND(E775=\"Feb\",OR(F775=2044,OR(F775=2048,F775=2052)))),29,VLOOKUP(E775,Lookup!$B$2:$C$13,2,FALSE))","v":29},0,null,null,{"$f":"+D775","v":23}]
[null,null,null,23,{"$f":"IF(E775=\"\",\"\",VLOOKUP(E775,Lookup!$A$2:$B$13,2,FALSE))","v":"Mar"},2044,null,null,null,null,null,null,null,null,null,null,null,null,null,null,null,null,null,null,null,null,null,null,null,null,{"$f":"IF(OR(AND(E776=\"Feb\",OR(F776=2020,OR(F776=2024,OR(F776=2028,OR(F776=2032,OR(F776=2036,F776=2040)))))),AND(E776=\"Feb\",OR(F776=2044,OR(F776=2048,F776=2052)))),29,VLOOKUP(E776,Lookup!$B$2:$C$13,2,FALSE))","v":31},0,null,null,23]
[null,null,null,23,{"$f":"IF(E776=\"\",\"\",VLOOKUP(E776,Lookup!$A$2:$B$13,2,FALSE))","v":"Apr"},2044,null,null,null,null,null,null,null,null,null,null,null,null,null,null,null,null,null,null,null,null,null,null,null,null,{"$f":"IF(OR(AND(E777=\"Feb\",OR(F777=2020,OR(F777=2024,OR(F777=2028,OR(F777=2032,OR(F777=2036,F777=2040)))))),AND(E777=\"Feb\",OR(F777=2044,OR(F777=2048,F777=2052)))),29,VLOOKUP(E777,Lookup!$B$2:$C$13,2,FALSE))","v":30},0,null,null,23]
[null,null,null,23,{"$f":"IF(E777=\"\",\"\",VLOOKUP(E777,Lookup!$A$2:$B$13,2,FALSE))","v":"May"},2044,null,null,null,null,null,null,null,null,null,null,null,null,null,null,null,null,null,null,null,null,null,null,null,null,{"$f":"IF(OR(AND(E778=\"Feb\",OR(F778=2020,OR(F778=2024,OR(F778=2028,OR(F778=2032,OR(F778=2036,F778=2040)))))),AND(E778=\"Feb\",OR(F778=2044,OR(F778=2048,F778=2052)))),29,VLOOKUP(E778,Lookup!$B$2:$C$13,2,FALSE))","v":31},0,null,null,23]
[null,null,null,{"$f":"+D767+1","v":23},{"$f":"IF(E778=\"\",\"\",VLOOKUP(E778,Lookup!$A$2:$B$13,2,FALSE))","v":"Jun"},2044,null,null,null,null,null,null,null,null,null,null,null,null,null,null,null,null,null,null,null,null,null,null,null,null,{"$f":"IF(OR(AND(E779=\"Feb\",OR(F779=2020,OR(F779=2024,OR(F779=2028,OR(F779=2032,OR(F779=2036,F779=2040)))))),AND(E779=\"Feb\",OR(F779=2044,OR(F779=2048,F779=2052)))),29,VLOOKUP(E779,Lookup!$B$2:$C$13,2,FALSE))","v":30},0,null,null,23]
[null,null,null,23,{"$f":"IF(E779=\"\",\"\",VLOOKUP(E779,Lookup!$A$2:$B$13,2,FALSE))","v":"Jul"},2044,null,null,null,null,null,null,null,null,null,null,null,null,null,null,null,null,null,null,null,null,null,null,null,null,{"$f":"IF(OR(AND(E780=\"Feb\",OR(F780=2020,OR(F780=2024,OR(F780=2028,OR(F780=2032,OR(F780=2036,F780=2040)))))),AND(E780=\"Feb\",OR(F780=2044,OR(F780=2048,F780=2052)))),29,VLOOKUP(E780,Lookup!$B$2:$C$13,2,FALSE))","v":31},0,null,null,23]
[null,null,null,23,{"$f":"IF(E780=\"\",\"\",VLOOKUP(E780,Lookup!$A$2:$B$13,2,FALSE))","v":"Aug"},2044,null,null,null,null,null,null,null,null,null,null,null,null,null,null,null,null,null,null,null,null,null,null,null,null,{"$f":"IF(OR(AND(E781=\"Feb\",OR(F781=2020,OR(F781=2024,OR(F781=2028,OR(F781=2032,OR(F781=2036,F781=2040)))))),AND(E781=\"Feb\",OR(F781=2044,OR(F781=2048,F781=2052)))),29,VLOOKUP(E781,Lookup!$B$2:$C$13,2,FALSE))","v":31},0,null,null,23]
[null,null,null,23,{"$f":"IF(E781=\"\",\"\",VLOOKUP(E781,Lookup!$A$2:$B$13,2,FALSE))","v":"Sep"},2044,null,null,null,null,null,null,null,null,null,null,null,null,null,null,null,null,null,null,null,null,null,null,null,null,{"$f":"IF(OR(AND(E782=\"Feb\",OR(F782=2020,OR(F782=2024,OR(F782=2028,OR(F782=2032,OR(F782=2036,F782=2040)))))),AND(E782=\"Feb\",OR(F782=2044,OR(F782=2048,F782=2052)))),29,VLOOKUP(E782,Lookup!$B$2:$C$13,2,FALSE))","v":30},0,null,null,23]
[null,null,null,23,{"$f":"IF(E782=\"\",\"\",VLOOKUP(E782,Lookup!$A$2:$B$13,2,FALSE))","v":"Oct"},2044,null,null,null,null,null,null,null,null,null,null,null,null,null,null,null,null,null,null,null,null,null,null,null,null,{"$f":"IF(OR(AND(E783=\"Feb\",OR(F783=2020,OR(F783=2024,OR(F783=2028,OR(F783=2032,OR(F783=2036,F783=2040)))))),AND(E783=\"Feb\",OR(F783=2044,OR(F783=2048,F783=2052)))),29,VLOOKUP(E783,Lookup!$B$2:$C$13,2,FALSE))","v":31},0,null,null,23]
[null,null,null,23,{"$f":"IF(E783=\"\",\"\",VLOOKUP(E783,Lookup!$A$2:$B$13,2,FALSE))","v":"Nov"},2044,null,null,null,null,null,null,null,null,null,null,null,null,null,null,null,null,null,null,null,null,null,null,null,null,{"$f":"IF(OR(AND(E784=\"Feb\",OR(F784=2020,OR(F784=2024,OR(F784=2028,OR(F784=2032,OR(F784=2036,F784=2040)))))),AND(E784=\"Feb\",OR(F784=2044,OR(F784=2048,F784=2052)))),29,VLOOKUP(E784,Lookup!$B$2:$C$13,2,FALSE))","v":30},0,null,null,23]
[null,null,null,23,{"$f":"IF(E784=\"\",\"\",VLOOKUP(E784,Lookup!$A$2:$B$13,2,FALSE))","v":"Dec"},2044,null,null,null,null,null,null,null,null,null,null,null,null,null,null,null,null,null,null,null,null,null,null,null,null,{"$f":"IF(OR(AND(E785=\"Feb\",OR(F785=2020,OR(F785=2024,OR(F785=2028,OR(F785=2032,OR(F785=2036,F785=2040)))))),AND(E785=\"Feb\",OR(F785=2044,OR(F785=2048,F785=2052)))),29,VLOOKUP(E785,Lookup!$B$2:$C$13,2,FALSE))","v":31},0,null,null,23]
[null,null,null,24,{"$f":"IF(E785=\"\",\"\",VLOOKUP(E785,Lookup!$A$2:$B$13,2,FALSE))","v":"Jan"},2045,null,null,null,null,null,null,null,null,null,null,null,null,null,null,null,null,null,null,null,null,null,null,null,null,{"$f":"IF(OR(AND(E786=\"Feb\",OR(F786=2020,OR(F786=2024,OR(F786=2028,OR(F786=2032,OR(F786=2036,F786=2040)))))),AND(E786=\"Feb\",OR(F786=2044,OR(F786=2048,F786=2052)))),29,VLOOKUP(E786,Lookup!$B$2:$C$13,2,FALSE))","v":31},0,null,null,24]
[null,null,null,24,{"$f":"IF(E786=\"\",\"\",VLOOKUP(E786,Lookup!$A$2:$B$13,2,FALSE))","v":"Feb"},2045,null,null,null,null,null,null,null,null,null,null,null,null,null,null,null,null,null,null,null,null,null,null,null,null,{"$f":"IF(OR(AND(E787=\"Feb\",OR(F787=2020,OR(F787=2024,OR(F787=2028,OR(F787=2032,OR(F787=2036,F787=2040)))))),AND(E787=\"Feb\",OR(F787=2044,OR(F787=2048,F787=2052)))),29,VLOOKUP(E787,Lookup!$B$2:$C$13,2,FALSE))","v":28},0,null,null,24]
[null,null,null,24,{"$f":"IF(E787=\"\",\"\",VLOOKUP(E787,Lookup!$A$2:$B$13,2,FALSE))","v":"Mar"},2045,null,null,null,null,null,null,null,null,null,null,null,null,null,null,null,null,null,null,null,null,null,null,null,null,{"$f":"IF(OR(AND(E788=\"Feb\",OR(F788=2020,OR(F788=2024,OR(F788=2028,OR(F788=2032,OR(F788=2036,F788=2040)))))),AND(E788=\"Feb\",OR(F788=2044,OR(F788=2048,F788=2052)))),29,VLOOKUP(E788,Lookup!$B$2:$C$13,2,FALSE))","v":31},0,null,null,24]
[null,null,null,24,{"$f":"IF(E788=\"\",\"\",VLOOKUP(E788,Lookup!$A$2:$B$13,2,FALSE))","v":"Apr"},2045,null,null,null,null,null,null,null,null,null,null,null,null,null,null,null,null,null,null,null,null,null,null,null,null,{"$f":"IF(OR(AND(E789=\"Feb\",OR(F789=2020,OR(F789=2024,OR(F789=2028,OR(F789=2032,OR(F789=2036,F789=2040)))))),AND(E789=\"Feb\",OR(F789=2044,OR(F789=2048,F789=2052)))),29,VLOOKUP(E789,Lookup!$B$2:$C$13,2,FALSE))","v":30},0,null,null,24]
[null,null,null,24,{"$f":"IF(E789=\"\",\"\",VLOOKUP(E789,Lookup!$A$2:$B$13,2,FALSE))","v":"May"},2045,null,null,null,null,null,null,null,null,null,null,null,null,null,null,null,null,null,null,null,null,null,null,null,null,{"$f":"IF(OR(AND(E790=\"Feb\",OR(F790=2020,OR(F790=2024,OR(F790=2028,OR(F790=2032,OR(F790=2036,F790=2040)))))),AND(E790=\"Feb\",OR(F790=2044,OR(F790=2048,F790=2052)))),29,VLOOKUP(E790,Lookup!$B$2:$C$13,2,FALSE))","v":31},0,null,null,24]
[null,null,null,24,{"$f":"IF(E790=\"\",\"\",VLOOKUP(E790,Lookup!$A$2:$B$13,2,FALSE))","v":"Jun"},2045,null,null,null,null,null,null,null,null,null,null,null,null,null,null,null,null,null,null,null,null,null,null,null,null,{"$f":"IF(OR(AND(E791=\"Feb\",OR(F791=2020,OR(F791=2024,OR(F791=2028,OR(F791=2032,OR(F791=2036,F791=2040)))))),AND(E791=\"Feb\",OR(F791=2044,OR(F791=2048,F791=2052)))),29,VLOOKUP(E791,Lookup!$B$2:$C$13,2,FALSE))","v":30},0,null,null,24]
[null,null,null,24,{"$f":"IF(E791=\"\",\"\",VLOOKUP(E791,Lookup!$A$2:$B$13,2,FALSE))","v":"Jul"},2045,null,null,null,null,null,null,null,null,null,null,null,null,null,null,null,null,null,null,null,null,null,null,null,null,{"$f":"IF(OR(AND(E792=\"Feb\",OR(F792=2020,OR(F792=2024,OR(F792=2028,OR(F792=2032,OR(F792=2036,F792=2040)))))),AND(E792=\"Feb\",OR(F792=2044,OR(F792=2048,F792=2052)))),29,VLOOKUP(E792,Lookup!$B$2:$C$13,2,FALSE))","v":31},0,null,null,24]
[null,null,null,24,{"$f":"IF(E792=\"\",\"\",VLOOKUP(E792,Lookup!$A$2:$B$13,2,FALSE))","v":"Aug"},2045,null,null,null,null,null,null,null,null,null,null,null,null,null,null,null,null,null,null,null,null,null,null,null,null,{"$f":"IF(OR(AND(E793=\"Feb\",OR(F793=2020,OR(F793=2024,OR(F793=2028,OR(F793=2032,OR(F793=2036,F793=2040)))))),AND(E793=\"Feb\",OR(F793=2044,OR(F793=2048,F793=2052)))),29,VLOOKUP(E793,Lookup!$B$2:$C$13,2,FALSE))","v":31},0,null,null,24]
[null,null,null,24,{"$f":"IF(E793=\"\",\"\",VLOOKUP(E793,Lookup!$A$2:$B$13,2,FALSE))","v":"Sep"},2045,null,null,null,null,null,null,null,null,null,null,null,null,null,null,null,null,null,null,null,null,null,null,null,null,{"$f":"IF(OR(AND(E794=\"Feb\",OR(F794=2020,OR(F794=2024,OR(F794=2028,OR(F794=2032,OR(F794=2036,F794=2040)))))),AND(E794=\"Feb\",OR(F794=2044,OR(F794=2048,F794=2052)))),29,VLOOKUP(E794,Lookup!$B$2:$C$13,2,FALSE))","v":30},0,null,null,24]
[null,null,null,24,{"$f":"IF(E794=\"\",\"\",VLOOKUP(E794,Lookup!$A$2:$B$13,2,FALSE))","v":"Oct"},2045,null,null,null,null,null,null,null,null,null,null,null,null,null,null,null,null,null,null,null,null,null,null,null,null,{"$f":"IF(OR(AND(E795=\"Feb\",OR(F795=2020,OR(F795=2024,OR(F795=2028,OR(F795=2032,OR(F795=2036,F795=2040)))))),AND(E795=\"Feb\",OR(F795=2044,OR(F795=2048,F795=2052)))),29,VLOOKUP(E795,Lookup!$B$2:$C$13,2,FALSE))","v":31},0,null,null,24]
[null,null,null,24,{"$f":"IF(E795=\"\",\"\",VLOOKUP(E795,Lookup!$A$2:$B$13,2,FALSE))","v":"Nov"},2045,null,null,null,null,null,null,null,null,null,null,null,null,null,null,null,null,null,null,null,null,null,null,null,null,{"$f":"IF(OR(AND(E796=\"Feb\",OR(F796=2020,OR(F796=2024,OR(F796=2028,OR(F796=2032,OR(F796=2036,F796=2040)))))),AND(E796=\"Feb\",OR(F796=2044,OR(F796=2048,F796=2052)))),29,VLOOKUP(E796,Lookup!$B$2:$C$13,2,FALSE))","v":30},0,null,null,24]
[null,null,null,24,{"$f":"IF(E796=\"\",\"\",VLOOKUP(E796,Lookup!$A$2:$B$13,2,FALSE))","v":"Dec"},2045,null,null,null,null,null,null,null,null,null,null,null,null,null,null,null,null,null,null,null,null,null,null,null,null,{"$f":"IF(OR(AND(E797=\"Feb\",OR(F797=2020,OR(F797=2024,OR(F797=2028,OR(F797=2032,OR(F797=2036,F797=2040)))))),AND(E797=\"Feb\",OR(F797=2044,OR(F797=2048,F797=2052)))),29,VLOOKUP(E797,Lookup!$B$2:$C$13,2,FALSE))","v":31},0,null,null,24]
[null,null,null,25,{"$f":"IF(E797=\"\",\"\",VLOOKUP(E797,Lookup!$A$2:$B$13,2,FALSE))","v":"Jan"},2046,null,null,null,null,null,null,null,null,null,null,null,null,null,null,null,null,null,null,null,null,null,null,null,null,{"$f":"IF(OR(AND(E798=\"Feb\",OR(F798=2020,OR(F798=2024,OR(F798=2028,OR(F798=2032,OR(F798=2036,F798=2040)))))),AND(E798=\"Feb\",OR(F798=2044,OR(F798=2048,F798=2052)))),29,VLOOKUP(E798,Lookup!$B$2:$C$13,2,FALSE))","v":31},0,null,null,{"$f":"+D798","v":25}]
[null,null,null,25,{"$f":"IF(E798=\"\",\"\",VLOOKUP(E798,Lookup!$A$2:$B$13,2,FALSE))","v":"Feb"},2046,null,null,null,null,null,null,null,null,null,null,null,null,null,null,null,null,null,null,null,null,null,null,null,null,{"$f":"IF(OR(AND(E799=\"Feb\",OR(F799=2020,OR(F799=2024,OR(F799=2028,OR(F799=2032,OR(F799=2036,F799=2040)))))),AND(E799=\"Feb\",OR(F799=2044,OR(F799=2048,F799=2052)))),29,VLOOKUP(E799,Lookup!$B$2:$C$13,2,FALSE))","v":28},0,null,null,{"$f":"+D799","v":25}]
[null,null,null,25,{"$f":"IF(E799=\"\",\"\",VLOOKUP(E799,Lookup!$A$2:$B$13,2,FALSE))","v":"Mar"},2046,null,null,null,null,null,null,null,null,null,null,null,null,null,null,null,null,null,null,null,null,null,null,null,null,{"$f":"IF(OR(AND(E800=\"Feb\",OR(F800=2020,OR(F800=2024,OR(F800=2028,OR(F800=2032,OR(F800=2036,F800=2040)))))),AND(E800=\"Feb\",OR(F800=2044,OR(F800=2048,F800=2052)))),29,VLOOKUP(E800,Lookup!$B$2:$C$13,2,FALSE))","v":31},0,null,null,25]
[null,null,null,25,{"$f":"IF(E800=\"\",\"\",VLOOKUP(E800,Lookup!$A$2:$B$13,2,FALSE))","v":"Apr"},2046,null,null,null,null,null,null,null,null,null,null,null,null,null,null,null,null,null,null,null,null,null,null,null,null,{"$f":"IF(OR(AND(E801=\"Feb\",OR(F801=2020,OR(F801=2024,OR(F801=2028,OR(F801=2032,OR(F801=2036,F801=2040)))))),AND(E801=\"Feb\",OR(F801=2044,OR(F801=2048,F801=2052)))),29,VLOOKUP(E801,Lookup!$B$2:$C$13,2,FALSE))","v":30},0,null,null,25]
[null,null,null,25,{"$f":"IF(E801=\"\",\"\",VLOOKUP(E801,Lookup!$A$2:$B$13,2,FALSE))","v":"May"},2046,null,null,null,null,null,null,null,null,null,null,null,null,null,null,null,null,null,null,null,null,null,null,null,null,{"$f":"IF(OR(AND(E802=\"Feb\",OR(F802=2020,OR(F802=2024,OR(F802=2028,OR(F802=2032,OR(F802=2036,F802=2040)))))),AND(E802=\"Feb\",OR(F802=2044,OR(F802=2048,F802=2052)))),29,VLOOKUP(E802,Lookup!$B$2:$C$13,2,FALSE))","v":31},0,null,null,25]
[null,null,null,25,{"$f":"IF(E802=\"\",\"\",VLOOKUP(E802,Lookup!$A$2:$B$13,2,FALSE))","v":"Jun"},2046,null,null,null,null,null,null,null,null,null,null,null,null,null,null,null,null,null,null,null,null,null,null,null,null,{"$f":"IF(OR(AND(E803=\"Feb\",OR(F803=2020,OR(F803=2024,OR(F803=2028,OR(F803=2032,OR(F803=2036,F803=2040)))))),AND(E803=\"Feb\",OR(F803=2044,OR(F803=2048,F803=2052)))),29,VLOOKUP(E803,Lookup!$B$2:$C$13,2,FALSE))","v":30},0,null,null,25]
[null,null,null,25,{"$f":"IF(E803=\"\",\"\",VLOOKUP(E803,Lookup!$A$2:$B$13,2,FALSE))","v":"Jul"},2046,null,null,null,null,null,null,null,null,null,null,null,null,null,null,null,null,null,null,null,null,null,null,null,null,{"$f":"IF(OR(AND(E804=\"Feb\",OR(F804=2020,OR(F804=2024,OR(F804=2028,OR(F804=2032,OR(F804=2036,F804=2040)))))),AND(E804=\"Feb\",OR(F804=2044,OR(F804=2048,F804=2052)))),29,VLOOKUP(E804,Lookup!$B$2:$C$13,2,FALSE))","v":31},0,null,null,25]
[null,null,null,25,{"$f":"IF(E804=\"\",\"\",VLOOKUP(E804,Lookup!$A$2:$B$13,2,FALSE))","v":"Aug"},2046,null,null,null,null,null,null,null,null,null,null,null,null,null,null,null,null,null,null,null,null,null,null,null,null,{"$f":"IF(OR(AND(E805=\"Feb\",OR(F805=2020,OR(F805=2024,OR(F805=2028,OR(F805=2032,OR(F805=2036,F805=2040)))))),AND(E805=\"Feb\",OR(F805=2044,OR(F805=2048,F805=2052)))),29,VLOOKUP(E805,Lookup!$B$2:$C$13,2,FALSE))","v":31},0,null,null,25]
[null,null,null,25,{"$f":"IF(E805=\"\",\"\",VLOOKUP(E805,Lookup!$A$2:$B$13,2,FALSE))","v":"Sep"},2046,null,null,null,null,null,null,null,null,null,null,null,null,null,null,null,null,null,null,null,null,null,null,null,null,{"$f":"IF(OR(AND(E806=\"Feb\",OR(F806=2020,OR(F806=2024,OR(F806=2028,OR(F806=2032,OR(F806=2036,F806=2040)))))),AND(E806=\"Feb\",OR(F806=2044,OR(F806=2048,F806=2052)))),29,VLOOKUP(E806,Lookup!$B$2:$C$13,2,FALSE))","v":30},0,null,null,25]
[null,null,null,25,{"$f":"IF(E806=\"\",\"\",VLOOKUP(E806,Lookup!$A$2:$B$13,2,FALSE))","v":"Oct"},2046,null,null,null,null,null,null,null,null,null,null,null,null,null,null,null,null,null,null,null,null,null,null,null,null,{"$f":"IF(OR(AND(E807=\"Feb\",OR(F807=2020,OR(F807=2024,OR(F807=2028,OR(F807=2032,OR(F807=2036,F807=2040)))))),AND(E807=\"Feb\",OR(F807=2044,OR(F807=2048,F807=2052)))),29,VLOOKUP(E807,Lookup!$B$2:$C$13,2,FALSE))","v":31},0,null,null,25]
[null,null,null,25,{"$f":"IF(E807=\"\",\"\",VLOOKUP(E807,Lookup!$A$2:$B$13,2,FALSE))","v":"Nov"},2046,null,null,null,null,null,null,null,null,null,null,null,null,null,null,null,null,null,null,null,null,null,null,null,null,{"$f":"IF(OR(AND(E808=\"Feb\",OR(F808=2020,OR(F808=2024,OR(F808=2028,OR(F808=2032,OR(F808=2036,F808=2040)))))),AND(E808=\"Feb\",OR(F808=2044,OR(F808=2048,F808=2052)))),29,VLOOKUP(E808,Lookup!$B$2:$C$13,2,FALSE))","v":30},0,null,null,25]
[null,null,null,25,{"$f":"IF(E808=\"\",\"\",VLOOKUP(E808,Lookup!$A$2:$B$13,2,FALSE))","v":"Dec"},2046,null,null,null,null,null,null,null,null,null,null,null,null,null,null,null,null,null,null,null,null,null,null,null,null,{"$f":"IF(OR(AND(E809=\"Feb\",OR(F809=2020,OR(F809=2024,OR(F809=2028,OR(F809=2032,OR(F809=2036,F809=2040)))))),AND(E809=\"Feb\",OR(F809=2044,OR(F809=2048,F809=2052)))),29,VLOOKUP(E809,Lookup!$B$2:$C$13,2,FALSE))","v":31},0,null,null,25]
[null,null,null,26,{"$f":"IF(E809=\"\",\"\",VLOOKUP(E809,Lookup!$A$2:$B$13,2,FALSE))","v":"Jan"},2047,null,null,null,null,null,null,null,null,null,null,null,null,null,null,null,null,null,null,null,null,null,null,null,null,{"$f":"IF(OR(AND(E810=\"Feb\",OR(F810=2020,OR(F810=2024,OR(F810=2028,OR(F810=2032,OR(F810=2036,F810=2040)))))),AND(E810=\"Feb\",OR(F810=2044,OR(F810=2048,F810=2052)))),29,VLOOKUP(E810,Lookup!$B$2:$C$13,2,FALSE))","v":31},0,null,null,26]
[null,null,null,26,{"$f":"IF(E810=\"\",\"\",VLOOKUP(E810,Lookup!$A$2:$B$13,2,FALSE))","v":"Feb"},2047,null,null,null,null,null,null,null,null,null,null,null,null,null,null,null,null,null,null,null,null,null,null,null,null,{"$f":"IF(OR(AND(E811=\"Feb\",OR(F811=2020,OR(F811=2024,OR(F811=2028,OR(F811=2032,OR(F811=2036,F811=2040)))))),AND(E811=\"Feb\",OR(F811=2044,OR(F811=2048,F811=2052)))),29,VLOOKUP(E811,Lookup!$B$2:$C$13,2,FALSE))","v":28},0,null,null,26]
[null,null,null,26,{"$f":"IF(E811=\"\",\"\",VLOOKUP(E811,Lookup!$A$2:$B$13,2,FALSE))","v":"Mar"},2047,null,null,null,null,null,null,null,null,null,null,null,null,null,null,null,null,null,null,null,null,null,null,null,null,{"$f":"IF(OR(AND(E812=\"Feb\",OR(F812=2020,OR(F812=2024,OR(F812=2028,OR(F812=2032,OR(F812=2036,F812=2040)))))),AND(E812=\"Feb\",OR(F812=2044,OR(F812=2048,F812=2052)))),29,VLOOKUP(E812,Lookup!$B$2:$C$13,2,FALSE))","v":31},0,null,null,26]
[null,null,null,26,{"$f":"IF(E812=\"\",\"\",VLOOKUP(E812,Lookup!$A$2:$B$13,2,FALSE))","v":"Apr"},2047,null,null,null,null,null,null,null,null,null,null,null,null,null,null,null,null,null,null,null,null,null,null,null,null,{"$f":"IF(OR(AND(E813=\"Feb\",OR(F813=2020,OR(F813=2024,OR(F813=2028,OR(F813=2032,OR(F813=2036,F813=2040)))))),AND(E813=\"Feb\",OR(F813=2044,OR(F813=2048,F813=2052)))),29,VLOOKUP(E813,Lookup!$B$2:$C$13,2,FALSE))","v":30},0,null,null,26]
[null,null,null,26,{"$f":"IF(E813=\"\",\"\",VLOOKUP(E813,Lookup!$A$2:$B$13,2,FALSE))","v":"May"},2047,null,null,null,null,null,null,null,null,null,null,null,null,null,null,null,null,null,null,null,null,null,null,null,null,{"$f":"IF(OR(AND(E814=\"Feb\",OR(F814=2020,OR(F814=2024,OR(F814=2028,OR(F814=2032,OR(F814=2036,F814=2040)))))),AND(E814=\"Feb\",OR(F814=2044,OR(F814=2048,F814=2052)))),29,VLOOKUP(E814,Lookup!$B$2:$C$13,2,FALSE))","v":31},0,null,null,26]
[null,null,null,26,{"$f":"IF(E814=\"\",\"\",VLOOKUP(E814,Lookup!$A$2:$B$13,2,FALSE))","v":"Jun"},2047,null,null,null,null,null,null,null,null,null,null,null,null,null,null,null,null,null,null,null,null,null,null,null,null,{"$f":"IF(OR(AND(E815=\"Feb\",OR(F815=2020,OR(F815=2024,OR(F815=2028,OR(F815=2032,OR(F815=2036,F815=2040)))))),AND(E815=\"Feb\",OR(F815=2044,OR(F815=2048,F815=2052)))),29,VLOOKUP(E815,Lookup!$B$2:$C$13,2,FALSE))","v":30},0,null,null,26]
[null,null,null,26,{"$f":"IF(E815=\"\",\"\",VLOOKUP(E815,Lookup!$A$2:$B$13,2,FALSE))","v":"Jul"},2047,null,null,null,null,null,null,null,null,null,null,null,null,null,null,null,null,null,null,null,null,null,null,null,null,{"$f":"IF(OR(AND(E816=\"Feb\",OR(F816=2020,OR(F816=2024,OR(F816=2028,OR(F816=2032,OR(F816=2036,F816=2040)))))),AND(E816=\"Feb\",OR(F816=2044,OR(F816=2048,F816=2052)))),29,VLOOKUP(E816,Lookup!$B$2:$C$13,2,FALSE))","v":31},0,null,null,26]
[null,null,null,26,{"$f":"IF(E816=\"\",\"\",VLOOKUP(E816,Lookup!$A$2:$B$13,2,FALSE))","v":"Aug"},2047,null,null,null,null,null,null,null,null,null,null,null,null,null,null,null,null,null,null,null,null,null,null,null,null,{"$f":"IF(OR(AND(E817=\"Feb\",OR(F817=2020,OR(F817=2024,OR(F817=2028,OR(F817=2032,OR(F817=2036,F817=2040)))))),AND(E817=\"Feb\",OR(F817=2044,OR(F817=2048,F817=2052)))),29,VLOOKUP(E817,Lookup!$B$2:$C$13,2,FALSE))","v":31},0,null,null,26]
[null,null,null,26,{"$f":"IF(E817=\"\",\"\",VLOOKUP(E817,Lookup!$A$2:$B$13,2,FALSE))","v":"Sep"},2047,null,null,null,null,null,null,null,null,null,null,null,null,null,null,null,null,null,null,null,null,null,null,null,null,{"$f":"IF(OR(AND(E818=\"Feb\",OR(F818=2020,OR(F818=2024,OR(F818=2028,OR(F818=2032,OR(F818=2036,F818=2040)))))),AND(E818=\"Feb\",OR(F818=2044,OR(F818=2048,F818=2052)))),29,VLOOKUP(E818,Lookup!$B$2:$C$13,2,FALSE))","v":30},0,null,null,26]
[null,null,null,26,{"$f":"IF(E818=\"\",\"\",VLOOKUP(E818,Lookup!$A$2:$B$13,2,FALSE))","v":"Oct"},2047,null,null,null,null,null,null,null,null,null,null,null,null,null,null,null,null,null,null,null,null,null,null,null,null,{"$f":"IF(OR(AND(E819=\"Feb\",OR(F819=2020,OR(F819=2024,OR(F819=2028,OR(F819=2032,OR(F819=2036,F819=2040)))))),AND(E819=\"Feb\",OR(F819=2044,OR(F819=2048,F819=2052)))),29,VLOOKUP(E819,Lookup!$B$2:$C$13,2,FALSE))","v":31},0,null,null,26]
[null,null,null,26,{"$f":"IF(E819=\"\",\"\",VLOOKUP(E819,Lookup!$A$2:$B$13,2,FALSE))","v":"Nov"},2047,null,null,null,null,null,null,null,null,null,null,null,null,null,null,null,null,null,null,null,null,null,null,null,null,{"$f":"IF(OR(AND(E820=\"Feb\",OR(F820=2020,OR(F820=2024,OR(F820=2028,OR(F820=2032,OR(F820=2036,F820=2040)))))),AND(E820=\"Feb\",OR(F820=2044,OR(F820=2048,F820=2052)))),29,VLOOKUP(E820,Lookup!$B$2:$C$13,2,FALSE))","v":30},0,null,null,26]
[null,null,null,26,{"$f":"IF(E820=\"\",\"\",VLOOKUP(E820,Lookup!$A$2:$B$13,2,FALSE))","v":"Dec"},2047,null,null,null,null,null,null,null,null,null,null,null,null,null,null,null,null,null,null,null,null,null,null,null,null,{"$f":"IF(OR(AND(E821=\"Feb\",OR(F821=2020,OR(F821=2024,OR(F821=2028,OR(F821=2032,OR(F821=2036,F821=2040)))))),AND(E821=\"Feb\",OR(F821=2044,OR(F821=2048,F821=2052)))),29,VLOOKUP(E821,Lookup!$B$2:$C$13,2,FALSE))","v":31},0,null,null,26]
[null,null,null,27,{"$f":"IF(E821=\"\",\"\",VLOOKUP(E821,Lookup!$A$2:$B$13,2,FALSE))","v":"Jan"},2048,null,null,null,null,null,null,null,null,null,null,null,null,null,null,null,null,null,null,null,null,null,null,null,null,{"$f":"IF(OR(AND(E822=\"Feb\",OR(F822=2020,OR(F822=2024,OR(F822=2028,OR(F822=2032,OR(F822=2036,F822=2040)))))),AND(E822=\"Feb\",OR(F822=2044,OR(F822=2048,F822=2052)))),29,VLOOKUP(E822,Lookup!$B$2:$C$13,2,FALSE))","v":31},0,null,null,{"$f":"+D822","v":27}]
[null,null,null,27,{"$f":"IF(E822=\"\",\"\",VLOOKUP(E822,Lookup!$A$2:$B$13,2,FALSE))","v":"Feb"},2048,null,null,null,null,null,null,null,null,null,null,null,null,null,null,null,null,null,null,null,null,null,null,null,null,{"$f":"IF(OR(AND(E823=\"Feb\",OR(F823=2020,OR(F823=2024,OR(F823=2028,OR(F823=2032,OR(F823=2036,F823=2040)))))),AND(E823=\"Feb\",OR(F823=2044,OR(F823=2048,F823=2052)))),29,VLOOKUP(E823,Lookup!$B$2:$C$13,2,FALSE))","v":29},0,null,null,{"$f":"+D823","v":27}]
[null,null,null,27,{"$f":"IF(E823=\"\",\"\",VLOOKUP(E823,Lookup!$A$2:$B$13,2,FALSE))","v":"Mar"},2048,null,null,null,null,null,null,null,null,null,null,null,null,null,null,null,null,null,null,null,null,null,null,null,null,{"$f":"IF(OR(AND(E824=\"Feb\",OR(F824=2020,OR(F824=2024,OR(F824=2028,OR(F824=2032,OR(F824=2036,F824=2040)))))),AND(E824=\"Feb\",OR(F824=2044,OR(F824=2048,F824=2052)))),29,VLOOKUP(E824,Lookup!$B$2:$C$13,2,FALSE))","v":31},0,null,null,27]
[null,null,null,27,{"$f":"IF(E824=\"\",\"\",VLOOKUP(E824,Lookup!$A$2:$B$13,2,FALSE))","v":"Apr"},2048,null,null,null,null,null,null,null,null,null,null,null,null,null,null,null,null,null,null,null,null,null,null,null,null,{"$f":"IF(OR(AND(E825=\"Feb\",OR(F825=2020,OR(F825=2024,OR(F825=2028,OR(F825=2032,OR(F825=2036,F825=2040)))))),AND(E825=\"Feb\",OR(F825=2044,OR(F825=2048,F825=2052)))),29,VLOOKUP(E825,Lookup!$B$2:$C$13,2,FALSE))","v":30},0,null,null,27]
[null,null,null,27,{"$f":"IF(E825=\"\",\"\",VLOOKUP(E825,Lookup!$A$2:$B$13,2,FALSE))","v":"May"},2048,null,null,null,null,null,null,null,null,null,null,null,null,null,null,null,null,null,null,null,null,null,null,null,null,{"$f":"IF(OR(AND(E826=\"Feb\",OR(F826=2020,OR(F826=2024,OR(F826=2028,OR(F826=2032,OR(F826=2036,F826=2040)))))),AND(E826=\"Feb\",OR(F826=2044,OR(F826=2048,F826=2052)))),29,VLOOKUP(E826,Lookup!$B$2:$C$13,2,FALSE))","v":31},0,null,null,27]
[null,null,null,27,{"$f":"IF(E826=\"\",\"\",VLOOKUP(E826,Lookup!$A$2:$B$13,2,FALSE))","v":"Jun"},2048,null,null,null,null,null,null,null,null,null,null,null,null,null,null,null,null,null,null,null,null,null,null,null,null,{"$f":"IF(OR(AND(E827=\"Feb\",OR(F827=2020,OR(F827=2024,OR(F827=2028,OR(F827=2032,OR(F827=2036,F827=2040)))))),AND(E827=\"Feb\",OR(F827=2044,OR(F827=2048,F827=2052)))),29,VLOOKUP(E827,Lookup!$B$2:$C$13,2,FALSE))","v":30},0,null,null,27]
[null,null,null,27,{"$f":"IF(E827=\"\",\"\",VLOOKUP(E827,Lookup!$A$2:$B$13,2,FALSE))","v":"Jul"},2048,null,null,null,null,null,null,null,null,null,null,null,null,null,null,null,null,null,null,null,null,null,null,null,null,{"$f":"IF(OR(AND(E828=\"Feb\",OR(F828=2020,OR(F828=2024,OR(F828=2028,OR(F828=2032,OR(F828=2036,F828=2040)))))),AND(E828=\"Feb\",OR(F828=2044,OR(F828=2048,F828=2052)))),29,VLOOKUP(E828,Lookup!$B$2:$C$13,2,FALSE))","v":31},0,null,null,27]
[null,null,null,27,{"$f":"IF(E828=\"\",\"\",VLOOKUP(E828,Lookup!$A$2:$B$13,2,FALSE))","v":"Aug"},2048,null,null,null,null,null,null,null,null,null,null,null,null,null,null,null,null,null,null,null,null,null,null,null,null,{"$f":"IF(OR(AND(E829=\"Feb\",OR(F829=2020,OR(F829=2024,OR(F829=2028,OR(F829=2032,OR(F829=2036,F829=2040)))))),AND(E829=\"Feb\",OR(F829=2044,OR(F829=2048,F829=2052)))),29,VLOOKUP(E829,Lookup!$B$2:$C$13,2,FALSE))","v":31},0,null,null,27]
[null,null,null,27,{"$f":"IF(E829=\"\",\"\",VLOOKUP(E829,Lookup!$A$2:$B$13,2,FALSE))","v":"Sep"},2048,null,null,null,null,null,null,null,null,null,null,null,null,null,null,null,null,null,null,null,null,null,null,null,null,{"$f":"IF(OR(AND(E830=\"Feb\",OR(F830=2020,OR(F830=2024,OR(F830=2028,OR(F830=2032,OR(F830=2036,F830=2040)))))),AND(E830=\"Feb\",OR(F830=2044,OR(F830=2048,F830=2052)))),29,VLOOKUP(E830,Lookup!$B$2:$C$13,2,FALSE))","v":30},{"$f":"SUM(G830:AD830)*AE830","v":0},null,null,27]
[null,null,null,27,{"$f":"IF(E830=\"\",\"\",VLOOKUP(E830,Lookup!$A$2:$B$13,2,FALSE))","v":"Oct"},{"$f":"IF(E830=0,\"\",IF(E830=\"Dec\",F830+1,F830))","v":2048},null,null,null,null,null,null,null,null,null,null,null,null,null,null,null,null,null,null,null,null,null,null,null,null,{"$f":"IF(OR(AND(E831=\"Feb\",OR(F831=2020,OR(F831=2024,OR(F831=2028,OR(F831=2032,OR(F831=2036,F831=2040)))))),AND(E831=\"Feb\",OR(F831=2044,OR(F831=2048,F831=2052)))),29,VLOOKUP(E831,Lookup!$B$2:$C$13,2,FALSE))","v":31},0,null,null,27]
[null,null,null,27,{"$f":"IF(E831=\"\",\"\",VLOOKUP(E831,Lookup!$A$2:$B$13,2,FALSE))","v":"Nov"},2048,null,null,null,null,null,null,null,null,null,null,null,null,null,null,null,null,null,null,null,null,null,null,null,null,{"$f":"IF(OR(AND(E832=\"Feb\",OR(F832=2020,OR(F832=2024,OR(F832=2028,OR(F832=2032,OR(F832=2036,F832=2040)))))),AND(E832=\"Feb\",OR(F832=2044,OR(F832=2048,F832=2052)))),29,VLOOKUP(E832,Lookup!$B$2:$C$13,2,FALSE))","v":30},0,null,null,27]
[null,null,null,27,{"$f":"IF(E832=\"\",\"\",VLOOKUP(E832,Lookup!$A$2:$B$13,2,FALSE))","v":"Dec"},2048,null,null,null,null,null,null,null,null,null,null,null,null,null,null,null,null,null,null,null,null,null,null,null,null,{"$f":"IF(OR(AND(E833=\"Feb\",OR(F833=2020,OR(F833=2024,OR(F833=2028,OR(F833=2032,OR(F833=2036,F833=2040)))))),AND(E833=\"Feb\",OR(F833=2044,OR(F833=2048,F833=2052)))),29,VLOOKUP(E833,Lookup!$B$2:$C$13,2,FALSE))","v":31},0,null,null,27]
[null,null,null,28,{"$f":"IF(E833=\"\",\"\",VLOOKUP(E833,Lookup!$A$2:$B$13,2,FALSE))","v":"Jan"},2049,null,null,null,null,null,null,null,null,null,null,null,null,null,null,null,null,null,null,null,null,null,null,null,null,{"$f":"IF(OR(AND(E834=\"Feb\",OR(F834=2020,OR(F834=2024,OR(F834=2028,OR(F834=2032,OR(F834=2036,F834=2040)))))),AND(E834=\"Feb\",OR(F834=2044,OR(F834=2048,F834=2052)))),29,VLOOKUP(E834,Lookup!$B$2:$C$13,2,FALSE))","v":31},0,null,null,28]
[null,null,null,28,{"$f":"IF(E834=\"\",\"\",VLOOKUP(E834,Lookup!$A$2:$B$13,2,FALSE))","v":"Feb"},2049,null,null,null,null,null,null,null,null,null,null,null,null,null,null,null,null,null,null,null,null,null,null,null,null,{"$f":"IF(OR(AND(E835=\"Feb\",OR(F835=2020,OR(F835=2024,OR(F835=2028,OR(F835=2032,OR(F835=2036,F835=2040)))))),AND(E835=\"Feb\",OR(F835=2044,OR(F835=2048,F835=2052)))),29,VLOOKUP(E835,Lookup!$B$2:$C$13,2,FALSE))","v":28},0,null,null,28]
[null,null,null,28,{"$f":"IF(E835=\"\",\"\",VLOOKUP(E835,Lookup!$A$2:$B$13,2,FALSE))","v":"Mar"},2049,null,null,null,null,null,null,null,null,null,null,null,null,null,null,null,null,null,null,null,null,null,null,null,null,{"$f":"IF(OR(AND(E836=\"Feb\",OR(F836=2020,OR(F836=2024,OR(F836=2028,OR(F836=2032,OR(F836=2036,F836=2040)))))),AND(E836=\"Feb\",OR(F836=2044,OR(F836=2048,F836=2052)))),29,VLOOKUP(E836,Lookup!$B$2:$C$13,2,FALSE))","v":31},0,null,null,28]
[null,null,null,28,{"$f":"IF(E836=\"\",\"\",VLOOKUP(E836,Lookup!$A$2:$B$13,2,FALSE))","v":"Apr"},2049,null,null,null,null,null,null,null,null,null,null,null,null,null,null,null,null,null,null,null,null,null,null,null,null,{"$f":"IF(OR(AND(E837=\"Feb\",OR(F837=2020,OR(F837=2024,OR(F837=2028,OR(F837=2032,OR(F837=2036,F837=2040)))))),AND(E837=\"Feb\",OR(F837=2044,OR(F837=2048,F837=2052)))),29,VLOOKUP(E837,Lookup!$B$2:$C$13,2,FALSE))","v":30},0,null,null,28]
[null,null,null,28,{"$f":"IF(E837=\"\",\"\",VLOOKUP(E837,Lookup!$A$2:$B$13,2,FALSE))","v":"May"},2049,null,null,null,null,null,null,null,null,null,null,null,null,null,null,null,null,null,null,null,null,null,null,null,null,{"$f":"IF(OR(AND(E838=\"Feb\",OR(F838=2020,OR(F838=2024,OR(F838=2028,OR(F838=2032,OR(F838=2036,F838=2040)))))),AND(E838=\"Feb\",OR(F838=2044,OR(F838=2048,F838=2052)))),29,VLOOKUP(E838,Lookup!$B$2:$C$13,2,FALSE))","v":31},0,null,null,28]
[null,null,null,28,{"$f":"IF(E838=\"\",\"\",VLOOKUP(E838,Lookup!$A$2:$B$13,2,FALSE))","v":"Jun"},2049,null,null,null,null,null,null,null,null,null,null,null,null,null,null,null,null,null,null,null,null,null,null,null,null,{"$f":"IF(OR(AND(E839=\"Feb\",OR(F839=2020,OR(F839=2024,OR(F839=2028,OR(F839=2032,OR(F839=2036,F839=2040)))))),AND(E839=\"Feb\",OR(F839=2044,OR(F839=2048,F839=2052)))),29,VLOOKUP(E839,Lookup!$B$2:$C$13,2,FALSE))","v":30},0,null,null,28]
[null,null,null,28,{"$f":"IF(E839=\"\",\"\",VLOOKUP(E839,Lookup!$A$2:$B$13,2,FALSE))","v":"Jul"},2049,null,null,null,null,null,null,null,null,null,null,null,null,null,null,null,null,null,null,null,null,null,null,null,null,{"$f":"IF(OR(AND(E840=\"Feb\",OR(F840=2020,OR(F840=2024,OR(F840=2028,OR(F840=2032,OR(F840=2036,F840=2040)))))),AND(E840=\"Feb\",OR(F840=2044,OR(F840=2048,F840=2052)))),29,VLOOKUP(E840,Lookup!$B$2:$C$13,2,FALSE))","v":31},0,null,null,28]
[null,null,null,28,{"$f":"IF(E840=\"\",\"\",VLOOKUP(E840,Lookup!$A$2:$B$13,2,FALSE))","v":"Aug"},2049,null,null,null,null,null,null,null,null,null,null,null,null,null,null,null,null,null,null,null,null,null,null,null,null,{"$f":"IF(OR(AND(E841=\"Feb\",OR(F841=2020,OR(F841=2024,OR(F841=2028,OR(F841=2032,OR(F841=2036,F841=2040)))))),AND(E841=\"Feb\",OR(F841=2044,OR(F841=2048,F841=2052)))),29,VLOOKUP(E841,Lookup!$B$2:$C$13,2,FALSE))","v":31},0,null,null,28]
[null,null,null,28,{"$f":"IF(E841=\"\",\"\",VLOOKUP(E841,Lookup!$A$2:$B$13,2,FALSE))","v":"Sep"},2049,null,null,null,null,null,null,null,null,null,null,null,null,null,null,null,null,null,null,null,null,null,null,null,null,{"$f":"IF(OR(AND(E842=\"Feb\",OR(F842=2020,OR(F842=2024,OR(F842=2028,OR(F842=2032,OR(F842=2036,F842=2040)))))),AND(E842=\"Feb\",OR(F842=2044,OR(F842=2048,F842=2052)))),29,VLOOKUP(E842,Lookup!$B$2:$C$13,2,FALSE))","v":30},0,null,null,28]
[null,null,null,{"$f":"+D831+1","v":28},{"$f":"IF(E842=\"\",\"\",VLOOKUP(E842,Lookup!$A$2:$B$13,2,FALSE))","v":"Oct"},2049,null,null,null,null,null,null,null,null,null,null,null,null,null,null,null,null,null,null,null,null,null,null,null,null,{"$f":"IF(OR(AND(E843=\"Feb\",OR(F843=2020,OR(F843=2024,OR(F843=2028,OR(F843=2032,OR(F843=2036,F843=2040)))))),AND(E843=\"Feb\",OR(F843=2044,OR(F843=2048,F843=2052)))),29,VLOOKUP(E843,Lookup!$B$2:$C$13,2,FALSE))","v":31},0,null,null,28]
[null,null,null,28,{"$f":"IF(E843=\"\",\"\",VLOOKUP(E843,Lookup!$A$2:$B$13,2,FALSE))","v":"Nov"},2049,null,null,null,null,null,null,null,null,null,null,null,null,null,null,null,null,null,null,null,null,null,null,null,null,{"$f":"IF(OR(AND(E844=\"Feb\",OR(F844=2020,OR(F844=2024,OR(F844=2028,OR(F844=2032,OR(F844=2036,F844=2040)))))),AND(E844=\"Feb\",OR(F844=2044,OR(F844=2048,F844=2052)))),29,VLOOKUP(E844,Lookup!$B$2:$C$13,2,FALSE))","v":30},0,null,null,28]
[null,null,null,28,{"$f":"IF(E844=\"\",\"\",VLOOKUP(E844,Lookup!$A$2:$B$13,2,FALSE))","v":"Dec"},2049,null,null,null,null,null,null,null,null,null,null,null,null,null,null,null,null,null,null,null,null,null,null,null,null,{"$f":"IF(OR(AND(E845=\"Feb\",OR(F845=2020,OR(F845=2024,OR(F845=2028,OR(F845=2032,OR(F845=2036,F845=2040)))))),AND(E845=\"Feb\",OR(F845=2044,OR(F845=2048,F845=2052)))),29,VLOOKUP(E845,Lookup!$B$2:$C$13,2,FALSE))","v":31},0,null,null,28]
[null,null,null,29,{"$f":"IF(E845=\"\",\"\",VLOOKUP(E845,Lookup!$A$2:$B$13,2,FALSE))","v":"Jan"},2050,null,null,null,null,null,null,null,null,null,null,null,null,null,null,null,null,null,null,null,null,null,null,null,null,{"$f":"IF(OR(AND(E846=\"Feb\",OR(F846=2020,OR(F846=2024,OR(F846=2028,OR(F846=2032,OR(F846=2036,F846=2040)))))),AND(E846=\"Feb\",OR(F846=2044,OR(F846=2048,F846=2052)))),29,VLOOKUP(E846,Lookup!$B$2:$C$13,2,FALSE))","v":31},0,null,null,{"$f":"+D846","v":29}]
[null,null,null,29,{"$f":"IF(E846=\"\",\"\",VLOOKUP(E846,Lookup!$A$2:$B$13,2,FALSE))","v":"Feb"},2050,null,null,null,null,null,null,null,null,null,null,null,null,null,null,null,null,null,null,null,null,null,null,null,null,{"$f":"IF(OR(AND(E847=\"Feb\",OR(F847=2020,OR(F847=2024,OR(F847=2028,OR(F847=2032,OR(F847=2036,F847=2040)))))),AND(E847=\"Feb\",OR(F847=2044,OR(F847=2048,F847=2052)))),29,VLOOKUP(E847,Lookup!$B$2:$C$13,2,FALSE))","v":28},0,null,null,{"$f":"+D847","v":29}]
[null,null,null,29,{"$f":"IF(E847=\"\",\"\",VLOOKUP(E847,Lookup!$A$2:$B$13,2,FALSE))","v":"Mar"},2050,null,null,null,null,null,null,null,null,null,null,null,null,null,null,null,null,null,null,null,null,null,null,null,null,{"$f":"IF(OR(AND(E848=\"Feb\",OR(F848=2020,OR(F848=2024,OR(F848=2028,OR(F848=2032,OR(F848=2036,F848=2040)))))),AND(E848=\"Feb\",OR(F848=2044,OR(F848=2048,F848=2052)))),29,VLOOKUP(E848,Lookup!$B$2:$C$13,2,FALSE))","v":31},0,null,null,29]
[null,null,null,29,{"$f":"IF(E848=\"\",\"\",VLOOKUP(E848,Lookup!$A$2:$B$13,2,FALSE))","v":"Apr"},2050,null,null,null,null,null,null,null,null,null,null,null,null,null,null,null,null,null,null,null,null,null,null,null,null,{"$f":"IF(OR(AND(E849=\"Feb\",OR(F849=2020,OR(F849=2024,OR(F849=2028,OR(F849=2032,OR(F849=2036,F849=2040)))))),AND(E849=\"Feb\",OR(F849=2044,OR(F849=2048,F849=2052)))),29,VLOOKUP(E849,Lookup!$B$2:$C$13,2,FALSE))","v":30},0,null,null,29]
[null,null,null,29,{"$f":"IF(E849=\"\",\"\",VLOOKUP(E849,Lookup!$A$2:$B$13,2,FALSE))","v":"May"},2050,null,null,null,null,null,null,null,null,null,null,null,null,null,null,null,null,null,null,null,null,null,null,null,null,{"$f":"IF(OR(AND(E850=\"Feb\",OR(F850=2020,OR(F850=2024,OR(F850=2028,OR(F850=2032,OR(F850=2036,F850=2040)))))),AND(E850=\"Feb\",OR(F850=2044,OR(F850=2048,F850=2052)))),29,VLOOKUP(E850,Lookup!$B$2:$C$13,2,FALSE))","v":31},0,null,null,29]
[null,null,null,29,{"$f":"IF(E850=\"\",\"\",VLOOKUP(E850,Lookup!$A$2:$B$13,2,FALSE))","v":"Jun"},2050,null,null,null,null,null,null,null,null,null,null,null,null,null,null,null,null,null,null,null,null,null,null,null,null,{"$f":"IF(OR(AND(E851=\"Feb\",OR(F851=2020,OR(F851=2024,OR(F851=2028,OR(F851=2032,OR(F851=2036,F851=2040)))))),AND(E851=\"Feb\",OR(F851=2044,OR(F851=2048,F851=2052)))),29,VLOOKUP(E851,Lookup!$B$2:$C$13,2,FALSE))","v":30},0,null,null,29]
[null,null,null,29,{"$f":"IF(E851=\"\",\"\",VLOOKUP(E851,Lookup!$A$2:$B$13,2,FALSE))","v":"Jul"},2050,null,null,null,null,null,null,null,null,null,null,null,null,null,null,null,null,null,null,null,null,null,null,null,null,{"$f":"IF(OR(AND(E852=\"Feb\",OR(F852=2020,OR(F852=2024,OR(F852=2028,OR(F852=2032,OR(F852=2036,F852=2040)))))),AND(E852=\"Feb\",OR(F852=2044,OR(F852=2048,F852=2052)))),29,VLOOKUP(E852,Lookup!$B$2:$C$13,2,FALSE))","v":31},0,null,null,29]
[null,null,null,29,{"$f":"IF(E852=\"\",\"\",VLOOKUP(E852,Lookup!$A$2:$B$13,2,FALSE))","v":"Aug"},2050,null,null,null,null,null,null,null,null,null,null,null,null,null,null,null,null,null,null,null,null,null,null,null,null,{"$f":"IF(OR(AND(E853=\"Feb\",OR(F853=2020,OR(F853=2024,OR(F853=2028,OR(F853=2032,OR(F853=2036,F853=2040)))))),AND(E853=\"Feb\",OR(F853=2044,OR(F853=2048,F853=2052)))),29,VLOOKUP(E853,Lookup!$B$2:$C$13,2,FALSE))","v":31},0,null,null,29]
[null,null,null,29,{"$f":"IF(E853=\"\",\"\",VLOOKUP(E853,Lookup!$A$2:$B$13,2,FALSE))","v":"Sep"},2050,null,null,null,null,null,null,null,null,null,null,null,null,null,null,null,null,null,null,null,null,null,null,null,null,{"$f":"IF(OR(AND(E854=\"Feb\",OR(F854=2020,OR(F854=2024,OR(F854=2028,OR(F854=2032,OR(F854=2036,F854=2040)))))),AND(E854=\"Feb\",OR(F854=2044,OR(F854=2048,F854=2052)))),29,VLOOKUP(E854,Lookup!$B$2:$C$13,2,FALSE))","v":30},0,null,null,29]
[null,null,null,29,{"$f":"IF(E854=\"\",\"\",VLOOKUP(E854,Lookup!$A$2:$B$13,2,FALSE))","v":"Oct"},2050,null,null,null,null,null,null,null,null,null,null,null,null,null,null,null,null,null,null,null,null,null,null,null,null,{"$f":"IF(OR(AND(E855=\"Feb\",OR(F855=2020,OR(F855=2024,OR(F855=2028,OR(F855=2032,OR(F855=2036,F855=2040)))))),AND(E855=\"Feb\",OR(F855=2044,OR(F855=2048,F855=2052)))),29,VLOOKUP(E855,Lookup!$B$2:$C$13,2,FALSE))","v":31},0,null,null,29]
[null,null,null,29,{"$f":"IF(E855=\"\",\"\",VLOOKUP(E855,Lookup!$A$2:$B$13,2,FALSE))","v":"Nov"},2050,null,null,null,null,null,null,null,null,null,null,null,null,null,null,null,null,null,null,null,null,null,null,null,null,{"$f":"IF(OR(AND(E856=\"Feb\",OR(F856=2020,OR(F856=2024,OR(F856=2028,OR(F856=2032,OR(F856=2036,F856=2040)))))),AND(E856=\"Feb\",OR(F856=2044,OR(F856=2048,F856=2052)))),29,VLOOKUP(E856,Lookup!$B$2:$C$13,2,FALSE))","v":30},0,null,null,29]
[null,null,null,29,{"$f":"IF(E856=\"\",\"\",VLOOKUP(E856,Lookup!$A$2:$B$13,2,FALSE))","v":"Dec"},2050,null,null,null,null,null,null,null,null,null,null,null,null,null,null,null,null,null,null,null,null,null,null,null,null,{"$f":"IF(OR(AND(E857=\"Feb\",OR(F857=2020,OR(F857=2024,OR(F857=2028,OR(F857=2032,OR(F857=2036,F857=2040)))))),AND(E857=\"Feb\",OR(F857=2044,OR(F857=2048,F857=2052)))),29,VLOOKUP(E857,Lookup!$B$2:$C$13,2,FALSE))","v":31},0,null,null,29]
[null,null,null,30,{"$f":"IF(E857=\"\",\"\",VLOOKUP(E857,Lookup!$A$2:$B$13,2,FALSE))","v":"Jan"},2051,null,null,null,null,null,null,null,null,null,null,null,null,null,null,null,null,null,null,null,null,null,null,null,null,{"$f":"IF(OR(AND(E858=\"Feb\",OR(F858=2020,OR(F858=2024,OR(F858=2028,OR(F858=2032,OR(F858=2036,F858=2040)))))),AND(E858=\"Feb\",OR(F858=2044,OR(F858=2048,F858=2052)))),29,VLOOKUP(E858,Lookup!$B$2:$C$13,2,FALSE))","v":31},0,null,null,30]
[null,null,null,30,{"$f":"IF(E858=\"\",\"\",VLOOKUP(E858,Lookup!$A$2:$B$13,2,FALSE))","v":"Feb"},2051,null,null,null,null,null,null,null,null,null,null,null,null,null,null,null,null,null,null,null,null,null,null,null,null,{"$f":"IF(OR(AND(E859=\"Feb\",OR(F859=2020,OR(F859=2024,OR(F859=2028,OR(F859=2032,OR(F859=2036,F859=2040)))))),AND(E859=\"Feb\",OR(F859=2044,OR(F859=2048,F859=2052)))),29,VLOOKUP(E859,Lookup!$B$2:$C$13,2,FALSE))","v":28},0,null,null,30]
[null,null,null,30,{"$f":"IF(E859=\"\",\"\",VLOOKUP(E859,Lookup!$A$2:$B$13,2,FALSE))","v":"Mar"},2051,null,null,null,null,null,null,null,null,null,null,null,null,null,null,null,null,null,null,null,null,null,null,null,null,{"$f":"IF(OR(AND(E860=\"Feb\",OR(F860=2020,OR(F860=2024,OR(F860=2028,OR(F860=2032,OR(F860=2036,F860=2040)))))),AND(E860=\"Feb\",OR(F860=2044,OR(F860=2048,F860=2052)))),29,VLOOKUP(E860,Lookup!$B$2:$C$13,2,FALSE))","v":31},0,null,null,30]
[null,null,null,30,{"$f":"IF(E860=\"\",\"\",VLOOKUP(E860,Lookup!$A$2:$B$13,2,FALSE))","v":"Apr"},2051,null,null,null,null,null,null,null,null,null,null,null,null,null,null,null,null,null,null,null,null,null,null,null,null,{"$f":"IF(OR(AND(E861=\"Feb\",OR(F861=2020,OR(F861=2024,OR(F861=2028,OR(F861=2032,OR(F861=2036,F861=2040)))))),AND(E861=\"Feb\",OR(F861=2044,OR(F861=2048,F861=2052)))),29,VLOOKUP(E861,Lookup!$B$2:$C$13,2,FALSE))","v":30},0,null,null,30]
[null,null,null,30,{"$f":"IF(E861=\"\",\"\",VLOOKUP(E861,Lookup!$A$2:$B$13,2,FALSE))","v":"May"},2051,null,null,null,null,null,null,null,null,null,null,null,null,null,null,null,null,null,null,null,null,null,null,null,null,{"$f":"IF(OR(AND(E862=\"Feb\",OR(F862=2020,OR(F862=2024,OR(F862=2028,OR(F862=2032,OR(F862=2036,F862=2040)))))),AND(E862=\"Feb\",OR(F862=2044,OR(F862=2048,F862=2052)))),29,VLOOKUP(E862,Lookup!$B$2:$C$13,2,FALSE))","v":31},0,null,null,30]
[null,null,null,30,{"$f":"IF(E862=\"\",\"\",VLOOKUP(E862,Lookup!$A$2:$B$13,2,FALSE))","v":"Jun"},2051,null,null,null,null,null,null,null,null,null,null,null,null,null,null,null,null,null,null,null,null,null,null,null,null,{"$f":"IF(OR(AND(E863=\"Feb\",OR(F863=2020,OR(F863=2024,OR(F863=2028,OR(F863=2032,OR(F863=2036,F863=2040)))))),AND(E863=\"Feb\",OR(F863=2044,OR(F863=2048,F863=2052)))),29,VLOOKUP(E863,Lookup!$B$2:$C$13,2,FALSE))","v":30},0,null,null,30]
[null,null,null,30,{"$f":"IF(E863=\"\",\"\",VLOOKUP(E863,Lookup!$A$2:$B$13,2,FALSE))","v":"Jul"},2051,null,null,null,null,null,null,null,null,null,null,null,null,null,null,null,null,null,null,null,null,null,null,null,null,{"$f":"IF(OR(AND(E864=\"Feb\",OR(F864=2020,OR(F864=2024,OR(F864=2028,OR(F864=2032,OR(F864=2036,F864=2040)))))),AND(E864=\"Feb\",OR(F864=2044,OR(F864=2048,F864=2052)))),29,VLOOKUP(E864,Lookup!$B$2:$C$13,2,FALSE))","v":31},0,null,null,30]
[null,null,null,30,{"$f":"IF(E864=\"\",\"\",VLOOKUP(E864,Lookup!$A$2:$B$13,2,FALSE))","v":"Aug"},2051,null,null,null,null,null,null,null,null,null,null,null,null,null,null,null,null,null,null,null,null,null,null,null,null,{"$f":"IF(OR(AND(E865=\"Feb\",OR(F865=2020,OR(F865=2024,OR(F865=2028,OR(F865=2032,OR(F865=2036,F865=2040)))))),AND(E865=\"Feb\",OR(F865=2044,OR(F865=2048,F865=2052)))),29,VLOOKUP(E865,Lookup!$B$2:$C$13,2,FALSE))","v":31},0,null,null,30]
[null,null,null,30,{"$f":"IF(E865=\"\",\"\",VLOOKUP(E865,Lookup!$A$2:$B$13,2,FALSE))","v":"Sep"},2051,null,null,null,null,null,null,null,null,null,null,null,null,null,null,null,null,null,null,null,null,null,null,null,null,{"$f":"IF(OR(AND(E866=\"Feb\",OR(F866=2020,OR(F866=2024,OR(F866=2028,OR(F866=2032,OR(F866=2036,F866=2040)))))),AND(E866=\"Feb\",OR(F866=2044,OR(F866=2048,F866=2052)))),29,VLOOKUP(E866,Lookup!$B$2:$C$13,2,FALSE))","v":30},0,null,null,30]
[null,null,null,30,{"$f":"IF(E866=\"\",\"\",VLOOKUP(E866,Lookup!$A$2:$B$13,2,FALSE))","v":"Oct"},2051,null,null,null,null,null,null,null,null,null,null,null,null,null,null,null,null,null,null,null,null,null,null,null,null,{"$f":"IF(OR(AND(E867=\"Feb\",OR(F867=2020,OR(F867=2024,OR(F867=2028,OR(F867=2032,OR(F867=2036,F867=2040)))))),AND(E867=\"Feb\",OR(F867=2044,OR(F867=2048,F867=2052)))),29,VLOOKUP(E867,Lookup!$B$2:$C$13,2,FALSE))","v":31},0,null,null,30]
[null,null,null,30,{"$f":"IF(E867=\"\",\"\",VLOOKUP(E867,Lookup!$A$2:$B$13,2,FALSE))","v":"Nov"},2051,null,null,null,null,null,null,null,null,null,null,null,null,null,null,null,null,null,null,null,null,null,null,null,null,{"$f":"IF(OR(AND(E868=\"Feb\",OR(F868=2020,OR(F868=2024,OR(F868=2028,OR(F868=2032,OR(F868=2036,F868=2040)))))),AND(E868=\"Feb\",OR(F868=2044,OR(F868=2048,F868=2052)))),29,VLOOKUP(E868,Lookup!$B$2:$C$13,2,FALSE))","v":30},0,null,null,30]
[null,null,null,30,{"$f":"IF(E868=\"\",\"\",VLOOKUP(E868,Lookup!$A$2:$B$13,2,FALSE))","v":"Dec"},2051,null,null,null,null,null,null,null,null,null,null,null,null,null,null,null,null,null,null,null,null,null,null,null,null,{"$f":"IF(OR(AND(E869=\"Feb\",OR(F869=2020,OR(F869=2024,OR(F869=2028,OR(F869=2032,OR(F869=2036,F869=2040)))))),AND(E869=\"Feb\",OR(F869=2044,OR(F869=2048,F869=2052)))),29,VLOOKUP(E869,Lookup!$B$2:$C$13,2,FALSE))","v":31},0,null,null,30]
[]
[]
[null,"<<<<<< END >>>>>>"]

{"sheet":"Lookup","index":3,"n_rows":29,"n_cols":9,"rows_kept":29,"cut":false,"hidden":true,"merged":[]}
["Month","Next Month","Days per Month",null,null,"Leap Years"]
["Jan","Feb",28,2009,null,2008,"2008-02-29",null,"Yes"]
["Feb","Mar",31,2010,null,2012,"2012-02-29",null,"No"]
["Mar","Apr",30,2011,null,{"$f":"+F3+4","v":2016},"2014-02-28"]
["Apr","May",31,2012,null,{"$f":"+F4+4","v":2020},{"$f":"+G2+1","v":"2008-03-01"}]
["May","Jun",30,2013,null,2024]
["Jun","Jul",31,null,null,2028]
["Jul","Aug",31,null,null,2032]
["Aug","Sep",30,null,null,2036]
["Sep","Oct",31,null,null,2040]
["Oct","Nov",30,null,null,2044]
["Nov","Dec",31,null,null,2048]
["Dec","Jan",31,null,null,2052]
[null,null,null,null,null,2056]
[null,null,null,null,null,2060]
[]
["Yes","Complete the hourly production data for all contract years on Part 2 - Data 2 worksheet"]
["No","Complete the hourly production data for the first contract year on Part 2 - Data 2 worksheet"]
[]
[]
["Renewable Resource"]
["biomass"]
["hydro"]
["geothermal"]
["solar"]
["wind"]
["ocean thermal"]
["wave action"]
["tidal action"]

{"sheet":"Part 3 - Qual Eval Scoresheet","index":4,"n_rows":42,"n_cols":9,"rows_kept":42,"cut":false,"hidden":false,"merged":[[37,7,37,8],[27,1,27,3],[28,1,28,3],[29,1,29,3],[30,1,30,3],[36,0,36,3],[31,1,31,3],[32,1,32,3],[13,1,13,3],[6,7,6,8],[26,1,26,3],[22,1,22,3],[23,1,23,3],[17,1,17,3],[14,1,14,3],[16,1,16,3],[19,1,19,3],[21,1,21,3],[24,1,24,3],[0,0,0,8],[1,0,1,8],[2,0,2,8],[12,1,12,3],[7,0,7,3],[9,1,9,3],[10,1,10,3],[11,1,11,3]]}
["Invitation for Bid: GPA-012-23"]
["Renewable Energy Resource  Acquisition for the Guam Power Authority (Phase IV)"]
["PART 3 - QUAL EVAL SCORESHEET"]
[null,null,null,null,null,null,null,"Date:"]
[{"$f":"CONCATENATE(\"Bidder's Name:  \", 'Workbook Instructions'!A6)","v":"Bidder's Name:  "}]
[{"$f":"CONCATENATE(\"Bidder's No.:  \", 'Workbook Instructions'!A9)","v":"Bidder's No.:  <<< BIDDER'S BID NO >>>"}]
[null,null,null,null,null,null,null,"BID EVALUTION"]
["EVALUATION FACTORS",null,null,null,"Raw Score Weight","MAX Possible Score","Maximum Weighted Possible Score ","RAW SCORE","WEIGHTED SCORE"]
["A.  PROJECT DEVELOPMENT",null,null,null,20,{"$f":"SUM(F10:F15)","v":26},{"$f":"+F9*E9","v":520},{"$f":"SUM(H10:H15)","v":0}]
[null,"A1.  Method and status of project financing (3)",null,null,null,3]
[null,"A2.  Level of site control by developer (6)",null,null,null,6]
[null,"A3.  Project team experience (5)",null,null,null,5]
[null,"A4.  Project Schedule & Commerical Operation Date (4)",null,null,null,4]
[null,"A5.  Status of equipment supply and EPC agreements (3)",null,null,null,3]
[null,"A6.  Bidder concurrence to the draft Purchase Power Agreement (5)",null,null,null,5]
["B.  PHYSICAL PROJECT CHARACTERISTICS",null,null,null,20,{"$f":"SUM(F17:F20)","v":20},{"$f":"+F16*E16","v":400},{"$f":"SUM(H17:H20)","v":0}]
[null,"B1.  Operating Profile (5)",null,null,null,5]
[null,"B2.  Point of delivery (5)",null,null,null,5]
[null,"B3.  Risk that the resource will not perform as expected (5)",null,null,null,5]
[null,"B4.  Project life and extension options. (5)",null,null,null,5]
["C.  POWER PRODUCT CHARACTERISTICS",null,null,null,25,{"$f":"SUM(F22:F25)","v":12},{"$f":"+F21*E21","v":300},{"$f":"SUM(H22:H24)","v":0}]
[null,"C1.  Guaranteed Annual MWH (3)",null,null,null,3]
[null,"C2.  Dispatchability (3) - Proposals not capable of energy shifting total daily solar generated energy shall be disqualified.",null,null,null,3]
[null,"C3.  Product flexibility (3)",null,null,null,3]
[null,"C4.  Contract Term (3)",null,null,null,3]
["D.  CREDIT EVALUATION",null,null,null,20,{"$f":"SUM(F27:F33)","v":21},{"$f":"+F26*E26","v":420},{"$f":"SUM(H27:H33)","v":0}]
[null,"D1.  Debt and equity ratings (3)",null,null,null,3]
[null,"D2.  Performance assurance (3)",null,null,null,3]
[null,"D3.  Financial ratio analysis (3)",null,null,null,3]
[null,"D4.  Default risk (3)",null,null,null,3]
[null,"D5.  Credit concentration and liquidity effect (3)",null,null,null,3]
[null,"D6.  Enforceability of contractual credit terms (3)",null,null,null,3]
[null,"D7.  Bidder revisions to contract templates that may affect credit requirements (3)",null,null,null,3]
["E.  Environmental Permits and Impacts",null,null,null,15,{"$f":"SUM(F35:F36)","v":15},{"$f":"+F34*E34","v":225},{"$f":"SUM(H35:H35)","v":0}]
[null,"E1.  Permits (5)",null,null,null,5]
[null,"E2.  Site Environmental Assessment (10)",null,null,null,10]
["TOTALS",null,null,null,{"$f":"+E9+E16+E21+E26+E34","v":100},{"$f":"+F9+F16+F21+F26+F34","v":94},{"$f":"SUM(G9:G36)","v":1865},{"$f":"+H9+H16+H21+H26+H34","v":0}]
[null,null,null,null,null,null,"EVALUATION RATING:"]
[]
[null,null,null,null,null,"ACCEPTABLE - Scores Greater Than or Equal to:",{"$f":"+G37*0.8","v":1492}]
[null,null,null,null,null,"POTENTIALLY ACCEPTABLE - Less than Acceptable but Greater Than or Equal to:",{"$f":"+G37*0.7","v":1305.5}]
[null,null,null,null,null,"UNACCEPTABLE - Scores are less than:",{"$f":"+G41","v":1305.5}]